program: Gaussian 09
title: 000213101
version: EM64L-G09RevD.01
frameworkgroup: C1[X(C16H16O4)]
method: RPBEPBE
basis: SDD
operation: Freq
keyword: #pfreq=noraman
keyword: PBEPBE/SDD
title: #p freq=noraman PBEPBE/SDD
converged: YES YES NO NO
title: Mulliken charges:
elementType: O O O O C C C C C C C C C C C C C C C C H H H H H H H H H H H H H H H H
charge: -0.258847 -0.261723 -0.419133 -0.267436 -0.533478 0.469356 -0.305450 0.146789 -0.449273 -0.398869 0.202804 -0.467452 0.212316 0.344051 -0.219770 -0.234535 -0.382215 -0.250482 -0.328098 -0.536253 0.235493 0.208349 0.251029 0.229966 0.226523 0.323653 0.297787 0.222652 0.215926 0.213248 0.246246 0.224358 0.355363 0.219209 0.248946 0.218951
chargesum: 0.00000
title: Mulliken charges with hydrogens summed into heavy atoms:
elementType: O O O O C C C C C C C C C C C C C C C C
charge: -0.258847 -0.261723 -0.063770 -0.267436 -0.089636 0.469356 0.175544 0.146789 -0.222750 -0.075215 0.202804 -0.169665 0.212316 0.344051 0.002883 -0.018609 -0.168968 -0.026124 -0.081852 0.150852
polarizability: 2.84592303e+02 1.20976428e-01 1.96827310e+02 1.83722518e-01 4.76140959e+00 9.15920612e+01
1716.lowfreq: -18.8997 -7.2735 -0.0005 -0.0005 0.0005 2.2994 4.2953 10.5666 31.9138
frequency: -18.2735 10.4312 31.9018 43.6864 66.3333 84.6684 101.5180 116.3251 156.5490 176.9555 223.1893 231.0986 241.1194 262.5548 300.1562 321.5850 358.0831 372.0370 379.1189 394.5481 406.3089 427.1812 443.4211 487.1940 504.2228 549.1967 563.4344 569.7973 616.8415 660.2596 684.1873 709.2566 714.8873 737.9138 752.1470 759.6693 771.1024 793.4609 812.7611 861.3517 885.2077 903.4973 924.3783 934.9158 950.7538 984.3928 987.5200 994.3121 1005.0879 1009.6039 1032.9713 1050.0255 1070.6983 1086.1926 1112.6651 1115.3987 1153.5034 1163.5835 1171.1165 1191.0330 1195.7625 1198.2544 1218.2084 1247.5278 1250.7846 1254.8108 1284.3908 1329.3620 1350.6852 1358.6470 1382.1369 1397.8824 1415.9874 1438.7049 1438.9099 1451.1657 1467.5186 1469.1093 1473.1729 1489.0119 1493.3999 1581.3800 1591.6008 1605.3910 1615.9150 1629.5279 2954.8606 2982.1641 3019.3580 3038.5379 3041.1125 3094.8936 3109.9922 3113.5364 3118.3483 3126.4225 3134.2043 3149.4831 3159.0115 3168.8277 3174.9270 3554.3801
redmass: 6.7482 6.6301 3.9038 5.2709 3.8430 3.6983 5.4262 4.7074 3.4762 4.8006 3.8056 2.3390 1.6136 4.1326 3.3483 4.8752 1.3930 2.9589 4.1423 7.1193 2.8515 2.4757 3.1719 4.3193 5.6348 3.5942 3.1250 3.7888 6.2746 6.8966 5.0061 1.9288 6.2493 3.4346 3.8511 2.2819 3.5605 1.5775 4.3649 1.2564 4.9457 1.4273 1.4712 1.4289 2.3475 1.3501 4.9426 3.4924 2.0332 1.9446 2.0733 3.4252 2.4968 1.6255 1.2634 1.8045 1.4206 1.4686 1.0694 1.2679 1.4976 1.3171 1.7869 1.8476 3.2330 1.7469 1.4222 1.4335 1.4107 1.3500 5.8473 6.1407 3.7531 1.4675 1.3978 1.2686 1.0506 1.1218 1.0737 2.1962 2.5758 7.3358 5.9402 8.5956 5.8083 7.0702 1.0334 1.0605 1.0643 1.0918 1.1039 1.1087 1.0865 1.0896 1.0870 1.0988 1.0927 1.0954 1.1014 1.0935 1.0918 1.0656
irintensity: 2.2162 0.3675 1.0206 0.0441 4.1788 2.1153 2.1947 1.7250 1.4863 0.3573 2.3116 0.3389 0.4377 4.8693 4.7530 3.7511 81.3034 32.1060 23.2968 0.4055 0.2283 3.0305 5.8130 7.2704 8.3372 8.7113 26.1883 6.2383 3.3478 1.7635 2.7933 48.8011 45.8624 23.5636 2.2620 30.9028 10.4356 56.7647 10.4172 0.0903 5.7979 3.8745 5.5283 14.2855 31.1039 0.0549 5.6717 45.6969 99.3242 78.6203 11.0938 64.5512 8.8758 19.7064 3.1258 272.9609 56.5382 26.3325 1.5196 9.2111 35.9387 28.1408 0.7208 189.2679 42.6985 139.7526 124.0433 7.7221 2.0669 16.0818 1.4275 80.0757 171.2663 1.0354 13.0532 19.9310 14.3551 14.1194 30.5380 25.8324 132.1979 113.7723 0.9580 144.3631 6.3483 3.2019 72.7783 24.7374 11.3867 42.5930 52.1337 10.3574 10.8963 18.9857 7.8155 21.1969 44.4343 0.1270 53.6014 9.7763 6.1954 37.8232
temp: 298.150 k
press: 1.00000 atm
elementType: 8 8 8 8 6 6 6 6 6 6 6 6 6 6 6 6 6 6 6 6 1 1 1 1 1 1 1 1 1 1 1 1 1 1 1 1
symmnumber: 1
zpe: 741640.6 jmol-1
zpe.correction: 0.282476 hartree
zpe.thermalcorrener: 0.300293 hartree
zpe.thermalcorrenthalpy: 0.301237 hartree
zpe.thermalcorrgfe: 0.234457 hartree
zpe.sumelectzpe: -918.729739 hartree
zpe.sumelectthermal: -918.711921 hartree
zpe.sumelectthermalent: -918.710977 hartree
zpe.sumelectthermalfe: -918.777757 hartree
dipole: 2.0232 -4.3983 0.4691
dipole: 4.8639
quadrupole: -90.1773 -107.5438 -120.9085
quadrupole: -18.5657 0.8510 -0.6935
quadrupole: 16.0326 -1.3339 -14.6987 -18.5657 0.8510 -0.6935
hfenergy: -919.0122145 hartree
pointgroup: C01 [X(C16H16O4)]
dipole: -0.7482064 0.9491549 1.4836604 debye
polarizability: 269.0246317|-45.5593578|136.7104622|25.8238283|42.6485981|167.2765807 unknown
InChI: InChI=1S/C16H16O4/c1-19-13-7-8-15(17)14(11-13)16(18)20-10-9-12-5-3-2-4-6-12/h2-8,11,17H,9-10H2,1H3
charge 0 multiplicity 1
36 atoms
O  0.621677 -0.188283 -0.949621
O  -5.167472 1.538245 -1.168102
O  -0.20569 0.765725 1.417924
O  -1.031234 -0.880031 -2.441737
C  2.440501 -1.867622 -0.829966
C  3.442732 -1.203722 0.109114
C  1.654811 -0.917812 -1.749602
C  -1.665002 0.493064 -0.544178
C  4.780256 -1.672998 0.162862
C  3.063903 -0.124641 0.953254
C  -0.694427 -0.262772 -1.397733
C  -2.936397 0.704994 -1.132661
C  -1.436315 0.987842 0.776849
C  -3.962789 1.398547 -0.459961
C  5.724577 -1.084733 1.035634
C  4.009776 0.46601 1.820999
C  -2.471428 1.681923 1.446768
C  5.341369 -0.00988 1.869186
C  -3.727941 1.896641 0.845201
C  -6.263711 2.237257 -0.495822
H  1.70306 -2.462835 -0.255605
H  2.977407 -2.581871 -1.484953
H  1.138109 -1.470848 -2.553123
H  2.305423 -0.138765 -2.182919
H  5.08614 -2.505099 -0.484452
H  2.032506 0.242832 0.920191
H  -3.117755 0.310361 -2.136434
H  6.753508 -1.461785 1.06192
H  3.708446 1.302466 2.463253
H  -2.294564 2.061628 2.461968
H  -4.499104 2.440599 1.397852
H  6.070317 0.451596 2.545253
H  -0.247387 1.1100 2.346255
H  -6.564846 1.716388 0.434577
H  -7.096528 2.221729 -1.213739
H  -5.993229 3.286353 -0.263655
