program: Gaussian 09
title: 000213078
version: EM64L-G09RevD.01
frameworkgroup: C1[X(C8H18O2)]
method: RPBEPBE
basis: SDD
operation: Freq
keyword: #pfreq=noraman
keyword: PBEPBE/SDD
title: #p freq=noraman PBEPBE/SDD
converged: YES YES NO NO
title: Mulliken charges:
elementType: O O C C C C C C C C H H H H H H H H H H H H H H H H H H
charge: -0.465063 -0.444070 -0.433150 -0.059606 -0.384342 -0.017803 -0.430261 -0.378057 -0.718423 -0.715746 0.222967 0.205021 0.191903 0.191368 0.187457 0.199746 0.214096 0.247213 0.216309 0.184547 0.223846 0.212542 0.201995 0.213539 0.204592 0.213600 0.343972 0.371809
chargesum: 0.00000
title: Mulliken charges with hydrogens summed into heavy atoms:
elementType: O O C C C C C C C C
charge: -0.121092 -0.072261 -0.005162 0.132297 -0.005517 0.181943 0.031048 0.022799 -0.080040 -0.084015
polarizability: 1.11934362e+02 -1.01180988e+00 8.76277853e+01 -9.26365216e-01 -1.71335390e+00 8.30081016e+01
1716.lowfreq: -17.7855 -0.0008 -0.0006 -0.0002 3.2325 13.0176 29.6870 51.2544 83.7313
frequency: 27.0101 51.2159 83.7031 111.1131 138.2808 150.6835 214.5569 226.8749 233.4369 249.4362 276.8150 310.0512 350.2440 390.5243 402.5779 440.5816 499.2146 605.1351 651.4075 757.5777 805.3931 828.4878 888.8930 912.4933 929.2402 931.4853 943.2017 951.6993 965.2551 1017.9766 1042.7061 1061.9112 1084.0683 1118.0677 1141.6877 1166.7799 1179.0889 1201.0211 1216.1510 1257.0985 1277.1382 1287.2471 1310.3865 1329.7544 1333.0067 1338.5363 1353.4458 1358.9186 1376.4788 1378.7024 1388.2472 1392.6307 1454.1047 1467.0479 1468.6837 1470.4937 1473.9940 1474.9636 1482.4305 1488.6194 2939.1782 2945.7379 2958.2558 2964.1676 2964.9723 2967.3181 2969.6493 2987.8902 2998.6663 3028.9574 3056.8374 3064.0299 3067.9126 3068.6487 3073.2026 3086.7010 3482.3266 3574.4047
redmass: 2.8605 3.7297 3.0931 3.8681 2.3497 2.0308 1.0972 3.1946 1.7178 1.5425 2.5114 2.4943 1.2874 2.3255 2.2337 2.2706 2.9485 2.3108 1.1137 1.3814 2.4396 2.8777 1.6862 1.1882 2.1511 2.4044 1.8131 1.6850 1.9338 2.0532 2.0057 1.9360 2.0470 1.6436 1.7509 1.9175 1.7977 1.4136 1.3424 1.1811 1.2699 1.1406 1.3475 1.4296 1.4736 1.3746 1.2994 1.4498 1.2176 1.2073 1.1994 1.2160 1.0726 1.0639 1.0678 1.0586 1.0645 1.0862 1.0563 1.0488 1.0772 1.0633 1.0772 1.0645 1.0388 1.0672 1.0371 1.0672 1.0978 1.1031 1.0991 1.0990 1.0988 1.0953 1.0986 1.0989 1.0651 1.0663
irintensity: 1.3955 3.0969 1.5914 6.0991 1.1812 1.3524 0.0247 0.9972 0.0311 0.8027 6.7728 1.5784 140.0664 2.2915 7.2414 2.3577 3.3299 32.1421 161.6394 12.7856 0.5023 3.0436 25.8248 3.6799 6.5909 33.6610 56.5986 11.7112 8.7427 40.0674 22.1724 6.3109 30.6047 31.7232 0.2212 29.1388 2.6097 13.1404 6.5178 3.9165 2.7825 0.7873 1.8997 2.7286 3.0423 8.1356 19.2042 0.7591 23.6443 12.1868 24.8694 10.5993 1.7888 1.0171 4.5535 0.4161 2.6358 12.5730 7.2657 25.1676 10.9306 8.4110 9.1855 8.1410 22.8986 171.6755 28.7398 49.8509 8.7449 63.1154 10.3444 70.3084 71.4617 31.5261 59.3732 22.3225 31.6898 7.9637
temp: 298.150 k
press: 1.00000 atm
elementType: 8 8 6 6 6 6 6 6 6 6 1 1 1 1 1 1 1 1 1 1 1 1 1 1 1 1 1 1
symmnumber: 1
zpe: 657448.7 jmol-1
zpe.correction: 0.250409 hartree
zpe.thermalcorrener: 0.263413 hartree
zpe.thermalcorrenthalpy: 0.264357 hartree
zpe.thermalcorrgfe: 0.210566 hartree
zpe.sumelectzpe: -465.217469 hartree
zpe.sumelectthermal: -465.204465 hartree
zpe.sumelectthermalent: -465.203521 hartree
zpe.sumelectthermalfe: -465.257313 hartree
dipole: -1.0397 -1.5457 -2.8345
dipole: 3.3919
quadrupole: -68.2072 -67.1244 -63.2718
quadrupole: -2.7263 -8.6310 -1.9585
quadrupole: -2.0061 -0.9232 2.9293 -2.7263 -8.6310 -1.9585
hfenergy: -465.4678782 hartree
pointgroup: C01 [X(C8H18O2)]
dipole: -0.3448882 0.687557 1.0904593 debye
polarizability: 112.0003917|0.0081377|87.3684603|-0.1924973|-2.003472|83.2013971 unknown
InChI: InChI=1S/C8H18O2/c1-7(2)3-4-8(5-9)6-10/h7-10H,3-6H2,1-2H3
charge 0 multiplicity 1
28 atoms
O  3.701785 0.687378 0.113142
O  2.365658 -1.542692 -1.073593
C  -0.117163 0.422816 -0.261589
C  1.24637 0.141088 0.42533
C  -1.328986 -0.121711 0.528192
C  -2.685738 -0.025188 -0.220462
C  2.305722 1.120252 -0.135162
C  1.719536 -1.328734 0.226175
C  -3.077938 1.438227 -0.53793
C  -3.802171 -0.719288 0.595535
H  -0.09109 -0.028283 -1.274917
H  -0.235066 1.516558 -0.40513
H  1.133273 0.308896 1.519711
H  -1.148782 -1.186417 0.785053
H  -1.4116 0.421434 1.494594
H  -2.575495 -0.567022 -1.184571
H  2.142251 2.1430 0.259727
H  2.236275 1.154622 -1.234623
H  0.855582 -2.01477 0.239918
H  2.404434 -1.623344 1.049376
H  -2.341169 1.930449 -1.197977
H  -4.0604 1.480829 -1.044033
H  -3.152897 2.03285 0.393789
H  -3.55031 -1.775811 0.805837
H  -3.952997 -0.207537 1.566157
H  -4.765521 -0.700855 0.052673
H  3.881408 0.690507 1.086378
H  3.226832 -1.04365 -1.034601
