program: Gaussian 09
title: 000213088
version: EM64L-G09RevD.01
frameworkgroup: C1[X(C9H14N2O4)]
method: RPBEPBE
basis: SDD
operation: Freq
keyword: #p
keyword: freq=noraman
keyword: PBEPBE/SDD
title: #p freq=noraman PBEPBE/SDD
converged: YES YES NO NO
title: Mulliken charges:
elementType: O O O O N N C C C C C C C C C H H H H H H H H H H H H H H
charge: -0.306806 -0.318351 -0.281010 -0.279113 -0.615958 -0.617798 0.265887 -0.362969 -0.309832 -0.523379 -0.736015 0.204747 0.294243 0.301403 -0.523155 0.218322 0.275813 0.258382 0.228330 0.242253 0.262899 0.206374 0.241333 0.237091 0.277596 0.338053 0.342097 0.338987 0.340577
chargesum: 0.00000
title: Mulliken charges with hydrogens summed into heavy atoms:
elementType: O O O O N N C C C C C C C C C
charge: -0.306806 -0.318351 -0.281010 -0.279113 0.064192 0.061766 0.265887 0.131166 0.176881 -0.018228 -0.051218 0.204747 0.294243 0.301403 -0.245559
polarizability: 1.38132004e+02 -4.92455307e+00 1.20463124e+02 1.05932154e+00 6.13000142e+00 1.03721416e+02
1716.lowfreq: -9.5575 -5.5911 0.0004 0.0004 0.0005 3.0241 20.9773 34.3145 36.3191
frequency: 20.9537 34.2650 36.2324 42.0455 57.0071 92.2841 118.7677 129.8781 162.0664 195.2874 208.2221 229.8350 246.3642 291.4909 309.4284 329.3426 364.8361 374.3695 433.3248 494.3309 497.0185 502.5373 513.2372 518.4597 522.2303 567.0085 614.0575 618.2739 628.7689 643.1253 699.3961 704.7708 759.2995 803.3945 844.3903 880.5395 888.6442 929.1614 961.4451 977.9712 1011.9000 1016.0014 1016.9654 1058.3033 1059.2926 1133.5116 1167.1508 1193.5274 1233.1431 1257.7269 1288.1087 1299.8606 1307.8251 1323.6634 1369.6732 1371.3107 1392.6961 1446.9772 1462.3168 1468.9161 1479.0166 1483.0658 1588.1429 1589.8762 1688.2632 1691.5347 2137.1162 2983.0798 2991.2655 3001.9720 3018.7559 3048.7083 3069.5962 3077.4514 3095.1288 3097.6036 3426.2322 3557.6921 3557.9577 3715.8587 3715.9137
redmass: 7.9222 5.5971 7.3382 5.1408 4.6717 3.8031 3.7819 4.1498 5.0469 3.6843 1.1481 6.6330 3.9852 2.7909 2.5412 2.5426 2.4864 3.1247 3.0858 2.3930 1.2798 1.2038 2.9890 1.1096 1.0791 3.9777 5.5127 4.6983 1.2414 1.2450 11.1934 11.2734 3.6099 4.0649 4.7056 1.8301 2.5594 1.7098 1.7964 2.6144 1.8417 6.2658 5.8554 2.0107 2.0062 1.7858 1.5295 2.2544 1.2353 1.5331 1.9090 2.2720 1.9112 1.6548 1.5897 1.5289 1.2374 1.0901 1.0790 1.0784 1.0671 1.0531 1.2044 1.2129 7.4373 7.4304 6.0556 1.0366 1.0586 1.0576 1.0579 1.1001 1.1060 1.0994 1.0997 1.1065 1.1582 1.0447 1.0446 1.1057 1.1058
irintensity: 0.6989 2.7552 2.0774 4.5562 7.1035 0.5696 1.9999 1.6071 12.5698 4.7293 0.6248 9.6736 7.4452 4.1282 4.5281 9.9198 8.2537 4.3070 9.8531 41.2779 108.1426 366.7746 14.0404 83.9355 34.2782 4.6937 2.4876 3.8256 74.2458 68.1341 29.3974 37.9597 6.6720 17.7787 42.9717 12.3670 13.2020 6.3382 3.8352 16.5319 34.8663 219.0548 156.8840 20.6831 10.8914 3.6111 0.5139 6.8785 10.3901 53.6836 265.2637 224.4161 213.2230 30.3626 75.7258 101.5556 8.9424 9.9602 7.6499 2.9524 27.4300 12.8102 126.4850 90.7764 281.1616 407.1443 10.3483 20.3831 12.9084 19.9034 34.1326 5.7565 5.0715 39.9500 19.2207 8.4230 66.6525 65.6431 62.3833 55.6752 47.5967
temp: 298.150 k
press: 1.00000 atm
elementType: 8 8 8 8 7 7 6 6 6 6 6 6 6 6 6 1 1 1 1 1 1 1 1 1 1 1 1 1 1
symmnumber: 1
zpe: 598953.2 jmol-1
zpe.correction: 0.228129 hartree
zpe.thermalcorrener: 0.245456 hartree
zpe.thermalcorrenthalpy: 0.246400 hartree
zpe.thermalcorrgfe: 0.180871 hartree
zpe.sumelectzpe: -760.563479 hartree
zpe.sumelectthermal: -760.546153 hartree
zpe.sumelectthermalent: -760.545209 hartree
zpe.sumelectthermalfe: -760.610738 hartree
dipole: 3.3021 -0.4723 -0.1294
dipole: 3.3382
quadrupole: -76.0757 -84.6246 -88.6532
quadrupole: 6.7340 10.9923 2.7723
quadrupole: 7.0422 -1.5068 -5.5354 6.7340 10.9923 2.7723
hfenergy: -760.7916083 hartree
pointgroup: C01 [X(C9H14N2O4)]
dipole: 1.3051511 0.0247905 -0.1443696 debye
polarizability: 138.9993539|-1.3625381|117.0028704|-2.658588|8.5079871|106.3143197 unknown
InChI: InChI=1S/C9H14N2O4/c1-3-4-9(2,5-14-7(10)12)6-15-8(11)13/h1H,4-6,10-11H2,2H3
charge 0 multiplicity 1
29 atoms
O  2.491806 -0.160745 0.555238
O  -1.613524 -0.943007 -0.162585
O  2.607775 -1.136461 -1.600329
O  -3.712889 -1.372987 0.821908
N  4.430611 -0.031398 -0.617053
N  -3.038052 -2.384128 -1.190581
C  0.105092 0.563025 0.713347
C  1.093112 -0.630708 0.710173
C  -1.316097 0.006731 0.938937
C  0.197756 1.299416 -0.667678
C  0.427147 1.534421 1.876123
C  -0.729902 2.434213 -0.808707
C  3.137716 -0.504357 -0.653725
C  -2.879936 -1.558835 -0.098698
C  -1.509095 3.382229 -0.937752
H  1.067578 -1.151193 1.683965
H  0.860915 -1.33557 -0.105741
H  -2.062592 0.820934 0.924792
H  -1.395188 -0.52745 1.904523
H  1.235543 1.661344 -0.799225
H  0.005844 0.566598 -1.473621
H  0.317867 1.032958 2.856185
H  -0.245885 2.409592 1.855782
H  1.467306 1.893575 1.793089
H  -2.188074 4.206248 -1.058511
H  4.77887 0.455251 0.205337
H  5.033388 -0.197195 -1.417746
H  -2.305312 -2.461201 -1.891827
H  -3.905378 -2.904201 -1.285423
