program: Gaussian 09
title: 000213075
version: EM64L-G09RevD.01
frameworkgroup: C1[X(C9H19NO3)]
method: RPBEPBE
basis: SDD
operation: Freq
keyword: #p
keyword: freq=noraman
keyword: PBEPBE/SDD
title: #p freq=noraman PBEPBE/SDD
converged: NO YES NO NO
title: Mulliken charges:
elementType: O O O N C C C C C C C C C H H H H H H H H H H H H H H H H H H H
charge: -0.337571 -0.443764 -0.293538 -0.376134 0.398254 -0.411245 -0.453545 -0.412653 -0.785056 -0.384753 -0.699542 0.324185 -0.606642 0.190222 0.200243 0.249491 0.256624 0.219425 0.201851 0.244051 0.216995 0.218343 0.231534 0.207027 0.202456 0.217405 0.216306 0.354215 0.323957 0.229388 0.230294 0.272177
chargesum: 0.00000
title: Mulliken charges with hydrogens summed into heavy atoms:
elementType: O O O N C C C C C C C C C
charge: -0.337571 -0.089549 -0.293538 -0.052177 0.398254 -0.020779 0.052570 0.008622 -0.105667 0.053808 -0.063376 0.324185 0.125218
polarizability: 1.33863562e+02 1.14007243e+00 1.17890000e+02 -7.84642882e+00 1.54168398e+00 9.48113427e+01
1716.lowfreq: -12.6679 -5.9345 -0.0008 -0.0007 -0.0004 8.4839 32.0591 33.7010 58.5245
frequency: 31.3928 33.6266 58.5025 59.1975 87.2109 99.6478 119.9928 148.7420 158.5357 192.1418 227.9934 241.5835 254.5835 269.4526 293.9617 308.6656 333.1731 368.0899 375.7587 430.7827 521.3499 551.7647 572.7647 594.9397 637.9488 691.6344 735.0194 769.4625 845.4289 855.8492 864.6488 899.8141 930.6522 933.2804 964.2529 986.0755 995.9462 1043.5634 1055.7819 1095.7758 1099.1933 1126.6267 1144.9048 1146.5907 1175.1732 1203.4173 1214.3944 1221.8046 1268.0040 1274.2797 1299.1898 1310.5986 1347.1829 1352.5125 1362.4835 1371.2722 1385.8176 1392.0015 1429.5482 1452.1632 1457.5614 1462.9317 1466.1264 1471.0311 1477.7544 1478.8407 1484.1516 1484.3897 1487.1840 1517.5443 1678.9689 2948.0507 2970.5548 2972.3799 2976.4489 2980.3279 2983.8852 3000.3235 3034.0803 3039.0693 3057.9364 3065.7099 3069.4505 3072.5798 3074.0331 3077.3956 3103.6766 3114.1649 3550.9059 3577.6903
redmass: 2.4591 4.2270 4.1041 2.4923 3.1986 1.1444 3.0104 3.3234 3.2942 3.2495 3.3666 1.1297 1.0770 3.5976 3.2578 2.3906 3.4114 2.8347 3.1455 2.3068 1.2317 2.4505 1.1328 3.1273 5.2875 12.1034 1.1442 3.3401 3.2098 1.3688 2.4520 1.7807 2.3075 2.1431 2.3370 3.4334 1.5489 1.8961 1.9595 4.8266 2.1250 1.2827 1.6815 1.4556 2.0399 2.2704 2.6141 1.5966 1.2532 1.3666 1.4251 1.2375 1.2300 1.4961 1.3097 1.2068 1.2100 1.2054 1.1627 1.0754 1.2159 1.0877 1.1447 1.0686 1.0529 1.0437 1.0717 1.0454 1.0548 1.4215 8.4210 1.0597 1.0370 1.0584 1.0400 1.0354 1.0603 1.0963 1.0577 1.1011 1.1027 1.1003 1.1004 1.0990 1.1004 1.1002 1.1077 1.0982 1.0657 1.0772
irintensity: 0.0340 3.2922 6.6159 1.7171 2.1141 0.5367 1.7011 0.4990 5.2768 1.8412 1.6271 0.0133 0.2599 8.5953 7.6853 3.0575 1.6485 31.6965 4.3145 6.0726 94.0797 15.3769 144.4729 14.8302 10.4470 23.6321 12.8465 5.4914 17.9278 1.1972 1.1032 20.8109 21.8433 36.8412 63.1152 77.9278 15.7394 16.5746 5.1919 233.5982 23.9201 0.0821 15.2158 20.2451 4.4556 217.1570 1.8413 5.5903 1.0091 9.9740 4.8578 3.2476 20.4238 1.3151 2.6394 16.8224 8.4153 18.7465 32.3811 3.9319 76.2435 3.5009 54.3542 6.6192 10.4937 14.5721 16.2076 11.2988 15.6634 159.3506 272.4278 18.6435 27.2198 78.8960 15.8256 77.6121 35.3729 24.0113 28.2809 6.8162 36.9483 14.2444 53.7390 62.3955 58.3421 32.6705 8.6019 3.9139 9.3264 33.7902
temp: 298.150 k
press: 1.00000 atm
elementType: 8 8 8 7 6 6 6 6 6 6 6 6 6 1 1 1 1 1 1 1 1 1 1 1 1 1 1 1 1 1 1 1
symmnumber: 1
zpe: 725841.9 jmol-1
zpe.correction: 0.276459 hartree
zpe.thermalcorrener: 0.292884 hartree
zpe.thermalcorrenthalpy: 0.293828 hartree
zpe.thermalcorrgfe: 0.231512 hartree
zpe.sumelectzpe: -633.706463 hartree
zpe.sumelectthermal: -633.690038 hartree
zpe.sumelectthermalent: -633.689093 hartree
zpe.sumelectthermalfe: -633.751410 hartree
dipole: 2.2987 -0.0516 -1.1446
dipole: 2.5684
quadrupole: -68.0547 -91.1370 -80.4426
quadrupole: -9.3416 -5.5912 -2.9827
quadrupole: 11.8234 -11.2589 -0.5645 -9.3416 -5.5912 -2.9827
hfenergy: -633.9829218 hartree
pointgroup: C01 [X(C9H19N1O3)]
dipole: -0.8458793 -0.1337639 -0.5363591 debye
polarizability: 131.2451248|4.2054958|117.7476531|11.6410027|-3.2149042|97.5721263 unknown
InChI: InChI=1S/C9H19NO3/c1-4-5-9(2,6-11)7-13-8(12)10-3/h10-11H,4-7H2,1-3H3
charge 0 multiplicity 1
32 atoms
O  -0.978165 0.971883 0.071515
O  1.00965 2.980525 -0.890337
O  -1.642872 -1.176386 0.811332
N  -2.913852 0.080061 -0.717479
C  1.519651 0.678593 0.047306
C  1.626791 -0.785083 -0.47739
C  0.25448 0.900433 0.911084
C  1.462181 1.616244 -1.199621
C  2.735297 1.072445 0.927067
C  1.839541 -1.886546 0.586391
C  1.944985 -3.287575 -0.055422
C  -1.841767 -0.149033 0.113224
C  -3.997604 -0.893288 -0.876242
H  2.465873 -0.825791 -1.20519
H  0.708427 -1.026522 -1.052123
H  0.300433 1.880549 1.413943
H  0.122241 0.099964 1.657535
H  2.476473 1.741505 -1.616785
H  0.812029 1.161719 -1.975119
H  2.75435 2.167535 1.075993
H  3.679744 0.773556 0.436007
H  2.705449 0.588043 1.920571
H  0.991362 -1.883352 1.296748
H  2.759076 -1.679503 1.167722
H  2.786015 -3.336649 -0.773528
H  1.017112 -3.538307 -0.602795
H  2.106188 -4.069516 0.70915
H  0.033807 2.935528 -0.719422
H  -2.94413 0.971813 -1.21167
H  -4.091546 -1.221579 -1.927806
H  -4.965644 -0.47519 -0.543235
H  -3.759473 -1.769274 -0.252522
