program: Gaussian 09
title: 000213080
version: EM64L-G09RevD.01
frameworkgroup: C1[X(C10H20N2O4)]
method: RPBEPBE
basis: SDD
operation: Freq
keyword: #p
keyword: freq=noraman
keyword: PBEPBE/SDD
title: #p freq=noraman PBEPBE/SDD
converged: YES YES NO NO
title: Mulliken charges:
elementType: O O O O N N C C C C C C C C C C H H H H H H H H H H H H H H H H H H H H
charge: -0.295177 -0.292949 -0.283460 -0.289647 -0.618630 -0.618233 0.003032 -0.090185 -0.397927 -0.401029 -0.383767 -0.354829 -0.722419 -0.723121 0.293021 0.293107 0.193275 0.263435 0.192206 0.211105 0.188880 0.199357 0.253468 0.234326 0.232731 0.237509 0.206166 0.212755 0.234806 0.203132 0.255601 0.210270 0.336537 0.340676 0.336668 0.339312
chargesum: 0.00000
title: Mulliken charges with hydrogens summed into heavy atoms:
elementType: O O O O N N C C C C C C C C C C
charge: -0.295177 -0.292949 -0.283460 -0.289647 0.058583 0.057747 0.196306 0.173250 0.005384 -0.012793 0.104027 0.115411 -0.068692 -0.054118 0.293021 0.293107
polarizability: 1.54410315e+02 -9.11291895e+00 1.27420097e+02 3.33148031e+00 -1.85891106e+00 1.22873241e+02
1716.lowfreq: -12.8641 -10.4948 -0.0008 -0.0003 0.0007 10.3915 19.5442 28.3598 35.6745
frequency: 18.7138 28.2130 35.5399 47.1194 54.5028 57.2082 68.8057 84.0696 102.7611 147.8988 169.9216 194.6638 213.1570 226.6427 249.2584 284.2670 297.7459 311.2072 337.3530 390.3332 438.6560 455.4592 473.7592 489.9137 494.5346 515.6119 520.2181 527.0771 561.2391 615.7892 635.6701 697.3254 704.0013 727.7389 764.1330 790.5172 799.3357 825.7375 878.0734 908.9995 922.0779 991.2004 1000.8105 1012.0058 1026.8739 1038.9716 1049.5370 1055.9165 1057.9370 1062.8268 1113.4550 1134.0957 1156.6053 1170.7298 1232.5011 1240.9137 1254.1171 1269.0342 1280.6071 1299.6283 1305.4156 1314.5377 1325.5779 1328.0347 1347.6094 1355.6481 1377.8371 1379.0797 1390.8303 1393.4543 1451.5620 1458.8367 1470.6357 1473.9844 1475.4607 1483.0987 1483.3559 1498.0402 1585.5031 1586.7447 1681.1025 1682.1033 2956.4686 2964.6100 2973.3137 2976.0564 2977.9757 3017.4842 3023.8635 3025.4844 3028.1037 3034.5986 3064.6635 3071.2523 3078.6934 3080.0262 3096.4340 3105.2310 3558.1597 3559.4386 3716.5191 3718.5005
redmass: 3.5866 4.9983 2.9479 4.5412 4.7165 4.6554 3.7366 2.8305 3.0931 3.1491 4.3848 2.3765 1.7538 1.4907 2.0612 2.8264 3.3510 2.5580 2.3071 3.0691 2.6803 3.1311 2.5287 1.1835 1.1900 1.1684 1.3337 1.6716 3.3162 5.2866 4.3745 11.4000 10.4674 1.9723 1.3006 3.1105 3.2221 1.5322 1.9994 1.9211 1.7054 3.0758 1.6410 2.9952 2.5128 1.9839 2.2878 2.0643 1.9959 2.7173 2.4780 2.5458 2.2569 2.2725 1.2140 1.2686 1.2392 1.1904 1.1708 2.3543 1.7115 1.5847 1.3942 1.3493 1.4729 1.4330 1.4243 1.4998 1.2091 1.2001 1.0982 1.0823 1.0723 1.0784 1.0509 1.0561 1.0531 1.0523 1.2173 1.2193 6.8458 6.8684 1.0716 1.0682 1.0368 1.0633 1.0391 1.0776 1.0886 1.0743 1.0883 1.0614 1.0986 1.0988 1.1008 1.1002 1.1067 1.1077 1.0445 1.0445 1.1058 1.1058
irintensity: 0.9431 0.8006 0.6470 4.0093 6.0384 4.8278 4.3307 2.3453 2.7076 2.2974 1.2084 6.6790 0.3379 1.0341 6.5277 4.5139 12.6276 12.2640 2.1181 9.2876 7.0821 3.9546 0.5516 265.4002 321.5641 33.5225 24.1629 6.3703 9.3115 1.2018 6.6521 33.8621 32.5141 5.2458 18.9636 9.5735 22.1055 1.5332 2.7157 2.5773 13.7246 157.9209 57.2791 106.7870 6.9755 42.3144 16.1189 33.4531 5.4114 1.8005 2.1193 6.0049 5.7140 0.0395 3.9755 23.3239 10.4329 2.8110 0.5374 525.1531 93.4765 48.9029 49.8244 11.9128 8.3907 25.8291 31.8024 28.6952 18.8851 15.5232 14.5551 6.2404 11.8996 11.3406 5.9070 14.8510 12.4023 13.2849 130.5298 58.2912 357.7654 374.0220 5.0648 17.2388 41.8936 53.8715 36.8708 8.5426 13.2230 43.0717 19.2908 37.3697 50.8238 45.9219 48.5181 42.7355 12.1434 11.0644 72.6123 64.0610 49.9162 48.8108
temp: 298.150 k
press: 1.00000 atm
elementType: 8 8 8 8 7 7 6 6 6 6 6 6 6 6 6 6 1 1 1 1 1 1 1 1 1 1 1 1 1 1 1 1 1 1 1 1
symmnumber: 1
zpe: 797839.5 jmol-1
zpe.correction: 0.303881 hartree
zpe.thermalcorrener: 0.323227 hartree
zpe.thermalcorrenthalpy: 0.324171 hartree
zpe.thermalcorrgfe: 0.253327 hartree
zpe.sumelectzpe: -802.202649 hartree
zpe.sumelectthermal: -802.183303 hartree
zpe.sumelectthermalent: -802.182359 hartree
zpe.sumelectthermalfe: -802.253203 hartree
dipole: 1.0876 -2.7864 0.7915
dipole: 3.0940
quadrupole: -86.9740 -89.5706 -96.0513
quadrupole: -7.1984 -14.6535 -6.7352
quadrupole: 3.8913 1.2947 -5.1860 -7.1984 -14.6535 -6.7352
hfenergy: -802.5065301 hartree
pointgroup: C01 [X(C10H20N2O4)]
dipole: -0.1962185 1.0930354 0.4985702 debye
polarizability: 149.3328587|-11.4230455|129.7814828|-8.5020377|4.9853143|125.5893121 unknown
InChI: InChI=1S/C10H20N2O4/c1-3-7(4-2)8(5-15-9(11)13)6-16-10(12)14/h7-8H,3-6,11-12H2,1-2H3
charge 0 multiplicity 1
36 atoms
O  -2.43522 0.928034 -0.518583
O  1.644242 1.400722 0.502921
O  -3.223424 -0.16635 1.422584
O  3.283228 0.673282 -1.043272
N  -3.973277 1.967519 0.792864
N  3.832163 1.460638 1.09777
C  0.595512 -1.475667 -0.096843
C  -0.230189 -0.149414 -0.006263
C  0.895815 -1.906544 -1.563889
C  -0.062366 -2.641919 0.699455
C  -1.552182 -0.241841 -0.794727
C  0.557705 1.093586 -0.46504
C  2.100046 -2.866024 -1.689375
C  -0.320409 -2.355725 2.196276
C  -3.218638 0.823959 0.648045
C  2.960284 1.132858 0.081835
H  1.569226 -1.261912 0.393388
H  -0.493728 0.00969 1.056374
H  -0.007623 -2.384925 -1.997367
H  1.115217 -1.014639 -2.181422
H  -1.01739 -2.933226 0.215733
H  0.600965 -3.524461 0.611921
H  -2.100046 -1.161963 -0.530864
H  -1.397708 -0.193792 -1.885205
H  1.007631 0.96358 -1.465296
H  -0.090673 1.98533 -0.456447
H  1.957363 -3.791401 -1.101491
H  2.262751 -3.162342 -2.742115
H  3.020513 -2.366952 -1.334864
H  0.590349 -1.964892 2.689778
H  -1.136491 -1.625397 2.338716
H  -0.615279 -3.282533 2.722569
H  -3.916948 2.713962 0.104484
H  -4.599165 2.040172 1.589629
H  3.480824 1.830252 1.977593
H  4.828225 1.334231 0.945124
