program: Gaussian 09
title: 000213076
version: EM64L-G09RevD.01
frameworkgroup: C1[X(C10H21NO3)]
method: RPBEPBE
basis: SDD
operation: Freq
keyword: #p
keyword: freq=noraman
keyword: PBEPBE/SDD
title: #p freq=noraman PBEPBE/SDD
converged: NO YES NO NO
title: Mulliken charges:
elementType: O O O N C C C C C C C C C C H H H H H H H H H H H H H H H H H H H H H
charge: -0.338830 -0.444140 -0.290820 -0.369066 0.399196 -0.412577 -0.453225 -0.413040 -0.786049 -0.383761 -0.699796 0.310455 -0.348679 -0.643629 0.201741 0.190012 0.249106 0.255382 0.219197 0.202253 0.218336 0.216865 0.243926 0.230105 0.207006 0.215974 0.217898 0.202417 0.354535 0.316569 0.217287 0.253411 0.219217 0.206278 0.236444
chargesum: 0.00000
title: Mulliken charges with hydrogens summed into heavy atoms:
elementType: O O O N C C C C C C C C C C
charge: -0.338830 -0.089605 -0.290820 -0.052497 0.399196 -0.020824 0.051264 0.008410 -0.106922 0.053350 -0.063507 0.310455 0.122020 0.018311
polarizability: 1.50672378e+02 1.23651967e+00 1.26962623e+02 -7.48903314e+00 1.02447271e+00 1.04126685e+02
1716.lowfreq: -7.8683 -0.0007 -0.0005 0.0002 9.4609 11.5210 24.6859 33.6922 39.8151
frequency: 24.4183 33.6860 39.5242 61.3426 64.3547 83.9125 100.6673 125.1618 150.9456 180.3775 226.0365 226.8235 242.6986 256.2092 276.3737 294.3391 308.7530 331.9869 355.5964 374.8762 398.8955 441.3795 523.6127 552.5329 567.6042 594.7103 635.0290 691.7400 736.3180 769.0913 776.5375 857.5395 861.8329 870.7341 886.9595 902.0640 931.4270 949.7733 977.5896 987.1402 998.1172 1044.2907 1055.9802 1077.3135 1098.9259 1118.2398 1144.6052 1147.3113 1175.7237 1202.0540 1215.2870 1222.5261 1269.8511 1274.8747 1290.5258 1300.0567 1311.7782 1347.6218 1352.2465 1357.2018 1365.5452 1371.2209 1385.6622 1389.6228 1390.6734 1453.2247 1460.1868 1463.4809 1464.7537 1469.9650 1471.2501 1477.0456 1478.7976 1480.8543 1484.4089 1486.1589 1495.2010 1673.1422 2949.2520 2970.5053 2972.0870 2975.8997 2982.6595 2983.9581 3002.3701 3002.6962 3034.6749 3038.9763 3065.7495 3069.3118 3069.3677 3072.1206 3073.9661 3077.1820 3086.4618 3099.6447 3104.6594 3549.7515 3566.7653
redmass: 2.5463 3.8173 3.3410 4.3733 2.3975 3.2988 3.5004 2.9220 3.3417 1.8779 2.7319 1.9544 1.1294 1.0542 2.8747 2.7854 2.3112 3.5231 2.9581 2.9247 2.5383 2.3232 1.2658 2.2270 1.2051 3.0263 4.5049 11.9042 1.1408 3.1690 1.3950 1.3940 2.1010 2.9864 2.2202 1.8647 1.8677 1.7700 3.2962 2.5760 1.9017 1.8903 1.9700 2.6948 2.0792 2.7878 1.7866 1.4862 2.0461 2.3576 2.4599 1.6273 1.2384 1.3976 1.1549 1.4198 1.2440 1.2343 1.4558 1.3105 1.3085 1.2052 1.2098 1.2185 1.2071 1.0758 1.1012 1.0801 1.0745 1.0571 1.0659 1.0578 1.0435 1.0694 1.0763 1.0584 1.6746 8.6719 1.0598 1.0378 1.0569 1.0414 1.0599 1.0358 1.0955 1.0659 1.0575 1.1012 1.1002 1.0990 1.1002 1.0989 1.1004 1.1002 1.0980 1.1021 1.1077 1.0657 1.0771
irintensity: 0.0512 1.4991 1.3837 4.8586 2.9557 0.9322 3.3161 1.9868 1.6520 0.4345 4.0542 3.2484 0.0398 0.1502 3.9619 7.4938 3.5933 2.3738 20.6129 8.6212 5.4321 6.1990 75.2952 29.5362 134.0534 15.0550 13.9811 21.8617 13.1513 7.7484 12.1723 1.3146 1.9932 10.3499 3.3256 22.4929 12.5222 23.9323 131.6777 78.9466 76.6968 17.0043 5.3074 44.9168 11.1627 88.5816 9.3577 12.0726 4.1410 253.0013 2.0805 5.3460 1.3766 9.0821 57.6260 4.9730 3.0940 19.7103 2.6867 1.4063 1.8163 16.5473 8.5858 21.4812 16.5695 5.3536 18.5370 8.3285 33.1380 18.8224 6.8273 11.8077 10.2102 13.9585 9.6182 19.7061 261.1876 273.3247 17.8248 24.9258 78.9099 14.9517 37.8408 27.8738 29.9678 37.3224 28.1691 8.2596 14.0015 4.2185 57.0151 65.5933 58.3754 35.2022 33.8641 35.2173 8.7670 10.0035 29.2525
temp: 298.150 k
press: 1.00000 atm
elementType: 8 8 8 7 6 6 6 6 6 6 6 6 6 6 1 1 1 1 1 1 1 1 1 1 1 1 1 1 1 1 1 1 1 1 1
symmnumber: 1
zpe: 799610.2 jmol-1
zpe.correction: 0.304555 hartree
zpe.thermalcorrener: 0.322207 hartree
zpe.thermalcorrenthalpy: 0.323151 hartree
zpe.thermalcorrgfe: 0.257456 hartree
zpe.sumelectzpe: -672.932534 hartree
zpe.sumelectthermal: -672.914883 hartree
zpe.sumelectthermalent: -672.913939 hartree
zpe.sumelectthermalfe: -672.979633 hartree
dipole: 2.4523 -0.0116 -1.0554
dipole: 2.6698
quadrupole: -75.2324 -97.9365 -86.3661
quadrupole: -8.9893 -5.1069 -2.5978
quadrupole: 11.2793 -11.4248 0.1455 -8.9893 -5.1069 -2.5978
hfenergy: -673.2370896 hartree
pointgroup: C01 [X(C10H21N1O3)]
dipole: 0.942807 -0.0822599 0.4556868 debye
polarizability: 149.669332|-3.2434284|126.856217|9.4749008|2.5226497|105.2361373 unknown
InChI: InChI=1S/C10H21NO3/c1-4-6-10(3,7-12)8-14-9(13)11-5-2/h11-12H,4-8H2,1-3H3
charge 0 multiplicity 1
35 atoms
O  0.538919 1.01489 -0.201856
O  -1.47816 2.992494 0.723467
O  1.245644 -1.156889 -0.824926
N  2.510274 0.216301 0.605038
C  -1.947336 0.638594 -0.098629
C  -1.998793 -0.802874 0.491836
C  -0.710575 0.856639 -1.00398
C  -1.886312 1.632342 1.103951
C  -3.19547 0.957827 -0.962992
C  -2.214936 -1.954611 -0.516737
C  -2.262079 -3.328978 0.186506
C  1.431999 -0.08489 -0.192977
C  3.650678 -0.701961 0.76084
C  4.887093 -0.271753 -0.056746
H  -1.056318 -0.995421 1.045234
H  -2.813343 -0.833767 1.247392
H  -0.802547 1.806143 -1.556603
H  -0.567763 0.021389 -1.70911
H  -2.893614 1.749532 1.539984
H  -1.206002 1.230201 1.882544
H  -3.175255 0.430037 -1.934425
H  -4.11845 0.654182 -0.435292
H  -3.25063 2.044206 -1.159326
H  -1.389694 -1.960394 -1.253597
H  -3.157456 -1.796631 -1.076481
H  -2.425633 -4.146861 -0.539005
H  -1.311078 -3.531624 0.713703
H  -3.078771 -3.368986 0.932722
H  -0.505579 2.964214 0.53135
H  2.543547 1.147159 1.022529
H  3.90641 -0.77347 1.83518
H  3.304557 -1.695896 0.430554
H  5.710695 -0.994503 0.08918
H  5.25103 0.725235 0.25322
H  4.64545 -0.234476 -1.133044
