program: Gaussian 09
title: 000213137
version: EM64L-G09RevD.01
frameworkgroup: C1[X(C21H25ClN2O2)]
method: RPBEPBE
basis: SDD
operation: Freq
keyword: #p
keyword: freq=noraman
keyword: PBEPBE/SDD
title: #p freq=noraman PBEPBE/SDD
converged: YES YES NO NO
title: Mulliken charges:
elementType: Cl O O N N C C C C C C C C C C C C C C C C C C C C C H H H H H H H H H H H H H H H H H H H H H H H H H
charge: -0.064547 -0.310821 -0.436471 -0.103541 -0.066496 -0.167539 -0.366265 -0.371246 -0.378285 -0.390808 -0.644485 0.413092 -0.312016 0.424440 0.165499 -0.427649 -0.417040 0.202247 -0.423151 -0.360229 -0.318424 -0.131081 -0.382418 -0.223506 -0.261985 -0.231062 0.211837 0.227414 0.186911 0.188598 0.226424 0.204330 0.187659 0.194947 0.204696 0.236836 0.250033 0.171120 0.202864 0.235624 0.194649 0.265878 0.229524 0.263247 0.216219 0.180607 0.256615 0.258864 0.228801 0.230691 0.329399
chargesum: 0.00000
title: Mulliken charges with hydrogens summed into heavy atoms:
elementType: Cl O O N N C C C C C C C C C C C C C C C C C C C C C
charge: -0.064547 -0.310821 -0.107072 -0.103541 -0.066496 0.044298 0.048060 0.043776 0.013704 0.008835 -0.157616 0.413092 0.061968 0.424440 0.165499 0.002624 -0.151162 0.202247 -0.193627 -0.096982 0.078403 -0.131081 -0.125803 0.035358 -0.033184 -0.000372
polarizability: 2.37907172e+02 -4.47611359e+01 3.20938955e+02 1.37717358e+01 6.21018557e+00 2.16202272e+02
1716.lowfreq: -9.0543 -4.8582 0.0006 0.0016 0.0018 4.1334 16.8441 26.1227 33.3503
frequency: 16.7543 26.1043 33.3435 38.0691 52.4794 60.1516 75.4871 94.8858 103.4886 119.2433 144.2368 160.2310 189.2868 201.8431 214.0257 241.9503 243.7022 260.7852 268.8132 289.2496 309.6459 317.3663 326.1733 331.9257 350.7972 386.0025 406.3575 429.9385 430.5500 461.0406 466.5497 485.1229 488.9587 520.9258 524.8543 550.5228 583.8779 615.5846 630.4735 644.8956 683.7867 689.4584 714.8379 742.4630 760.1321 765.9545 772.0697 777.0749 813.3986 822.9793 832.8427 845.5168 858.6506 868.4109 889.7372 897.9943 936.1433 943.4497 949.7272 955.5276 961.4011 977.8128 995.3027 1006.9770 1037.2811 1044.9613 1052.1100 1057.6964 1067.8994 1077.5432 1079.3946 1092.5405 1100.3194 1115.5641 1119.2040 1131.7885 1145.2178 1154.1433 1162.8189 1167.3465 1175.8336 1190.9228 1202.2385 1205.7912 1226.2999 1240.8088 1247.6827 1252.7323 1254.3812 1264.0993 1272.2881 1288.4014 1291.9334 1297.7373 1308.7354 1324.9636 1334.0378 1340.6332 1348.8822 1357.7067 1371.6163 1377.6943 1382.0821 1383.2456 1387.9140 1395.6128 1411.7891 1433.7458 1453.4611 1453.7573 1461.2558 1464.6186 1466.3676 1467.7294 1472.0132 1475.7028 1485.2255 1487.5837 1575.5049 1586.1899 1602.5681 1618.5351 2825.3547 2825.6972 2848.3454 2858.8496 2863.8658 2874.9445 2945.1179 2974.2058 2993.1359 3001.1732 3025.3271 3042.9486 3045.6648 3051.6980 3058.1166 3061.8787 3075.9396 3113.3937 3138.5045 3148.5149 3156.6655 3160.1672 3172.3065 3180.1353 3559.0627
redmass: 5.5893 5.9386 5.1913 2.6404 3.7626 2.4024 4.2961 5.3652 4.4012 3.9373 3.9957 5.3783 4.1790 5.1882 2.7686 3.8334 3.4266 3.1306 3.7352 4.5753 1.5023 2.0956 2.7160 4.3498 4.0906 2.8021 2.6047 4.5779 5.1578 3.2688 3.2403 3.6080 3.3039 4.9883 3.8726 3.8171 4.6065 2.3390 6.8438 6.2561 4.0769 4.7721 3.7271 3.7039 1.3681 3.5641 1.1808 3.1797 4.4350 1.5023 3.7009 1.5462 1.4261 1.2266 1.6265 3.3082 1.8287 1.8639 1.3422 2.7793 3.3650 1.3145 2.7235 2.4518 2.4528 2.1421 2.7033 2.4064 2.1955 2.0315 2.0921 2.1166 1.9462 1.7595 2.1911 2.5326 3.0175 2.2378 1.6496 1.1944 1.6153 1.2563 1.7539 1.7243 1.5688 1.5374 2.3015 1.6640 1.4402 1.3104 1.3722 1.0952 1.3284 1.3448 1.2901 1.4744 1.3045 1.2953 1.4159 1.5744 1.4472 6.7387 1.5208 1.4421 3.9362 1.4311 2.9506 2.2386 1.0852 1.0792 1.0934 2.2671 1.0828 1.1177 1.6157 1.1083 1.6040 1.0956 7.2911 6.6787 7.5774 7.1661 1.0722 1.0793 1.0711 1.0703 1.0707 1.0687 1.0692 1.0654 1.0626 1.0847 1.0893 1.0990 1.0887 1.0929 1.0870 1.0882 1.0996 1.0882 1.0879 1.0921 1.0938 1.0885 1.0998 1.0977 1.0661
irintensity: 0.1102 0.8131 0.4066 1.3454 2.2373 1.3601 0.9873 0.6315 0.4565 2.7339 3.4815 1.0407 0.6743 0.0504 0.8531 0.3555 1.9841 2.6677 4.2618 3.0604 87.0602 55.2287 5.0906 24.9727 4.9845 1.0163 2.6417 3.5422 4.5109 2.8015 4.3139 10.2346 5.2810 7.7033 0.2888 1.7037 3.2523 0.1857 0.3905 4.8597 5.0725 15.6645 5.6960 14.5021 87.6534 7.2927 3.9703 13.6130 22.8322 49.8178 26.0011 0.2056 3.9175 10.9419 14.4815 9.6402 1.9868 1.6461 1.0777 17.5596 117.4360 0.5354 15.4869 16.6117 8.6742 2.8808 10.1556 9.7549 2.9410 14.0491 12.5903 23.8948 13.1550 36.8399 64.3103 33.3820 39.5723 6.5181 3.3489 1.9318 30.8067 0.8129 40.5805 0.6321 14.9083 38.6386 195.3071 109.3929 53.7752 9.0164 25.3052 3.1217 8.6648 6.5394 15.0120 12.0181 29.9270 7.2289 1.8876 12.9525 3.5849 0.7757 12.9314 22.3343 5.6094 2.6388 49.4969 75.6032 5.8280 0.8924 18.7195 221.0323 1.7649 3.0922 4.1297 2.1377 103.2086 7.2139 17.7182 30.7833 0.1344 4.5551 117.3430 17.1493 67.4578 6.3942 2.5186 266.4092 73.6408 12.7321 25.0581 34.1100 48.8892 20.7210 40.8872 5.8970 40.2184 15.2407 59.2446 9.6019 9.1380 1.5382 22.8003 1.3146 16.8319 3.0047 7.2520
temp: 298.150 k
press: 1.00000 atm
elementType: 17 8 8 7 7 6 6 6 6 6 6 6 6 6 6 6 6 6 6 6 6 6 6 6 6 6 1 1 1 1 1 1 1 1 1 1 1 1 1 1 1 1 1 1 1 1 1 1 1 1 1
symmnumber: 1
zpe: 1099395.1 jmol-1
zpe.correction: 0.418737 hartree
zpe.thermalcorrener: 0.442745 hartree
zpe.thermalcorrenthalpy: 0.443689 hartree
zpe.thermalcorrgfe: 0.362906 hartree
zpe.sumelectzpe: -1533.269411 hartree
zpe.sumelectthermal: -1533.245403 hartree
zpe.sumelectthermalent: -1533.244459 hartree
zpe.sumelectthermalfe: -1533.325243 hartree
dipole: 0.7205 2.6114 0.3556
dipole: 2.7322
quadrupole: -191.6362 -162.6428 -149.2836
quadrupole: -6.1445 -3.3661 -7.3010
quadrupole: -23.7820 5.2114 18.5706 -6.1445 -3.3661 -7.3010
hfenergy: -1533.6881485 hartree
pointgroup: C01 [X(C21H25Cl1N2O2)]
dipole: 0.5892165 -0.8819047 -0.1747326 debye
polarizability: 220.4992355|12.8745849|338.5826301|-14.1373397|9.4270411|215.9665343 unknown
InChI: InChI=1S/C21H25ClN2O2/c22-17-6-7-21-18(15-17)19(14-16-4-1-2-5-20(16)26-21)24-11-9-23(10-12-24)8-3-13-25/h1-2,4-7,15,19,25H,3,8-14H2
charge 0 multiplicity 1
51 atoms
Cl 2.35737 5.581672 0.835694
O  2.271284 -0.045832 -1.313171
O  -7.895177 0.242372 -1.013153
N  -0.293474 -0.034293 0.778963
N  -3.152036 -0.550908 0.465378
C  0.946137 0.48519 1.427146
C  -1.248655 1.046188 0.415806
C  -0.992319 -1.059265 1.597177
C  -2.452869 0.474728 -0.347616
C  -2.19742 -1.626947 0.830803
C  1.956972 -0.657043 1.750855
C  1.626879 1.530294 0.554444
C  -4.360797 -1.100777 -0.196022
C  2.128823 -1.672954 0.633724
C  2.245041 1.211288 -0.684635
C  -5.493843 -0.065751 -0.362124
C  1.68544 2.874267 1.000189
C  2.237078 -1.340767 -0.742082
C  2.163563 -3.053653 0.966265
C  2.855242 2.222767 -1.46697
C  -6.800756 -0.726484 -0.838434
C  2.310337 3.862873 0.222506
C  2.365675 -2.345686 -1.730635
C  2.895003 3.557585 -1.021691
C  2.303116 -4.066414 -0.004498
C  2.398714 -3.704965 -1.368547
H  0.700034 0.982278 2.402525
H  -0.734667 1.783048 -0.224403
H  -1.620913 1.579628 1.327194
H  -1.346485 -0.628034 2.567956
H  -0.301452 -1.890969 1.813708
H  -3.149423 1.301843 -0.571562
H  -2.094002 0.047177 -1.319164
H  -1.816885 -2.16498 -0.074588
H  -2.720408 -2.361903 1.471506
H  1.638209 -1.192388 2.663182
H  2.921054 -0.174599 2.003146
H  -4.113724 -1.54744 -1.196508
H  -4.731673 -1.929644 0.439699
H  -5.667323 0.439701 0.60543
H  -5.200296 0.713582 -1.095154
H  1.222402 3.138743 1.956538
H  2.079119 -3.32936 2.025358
H  3.305106 1.937297 -2.422163
H  -7.182362 -1.428538 -0.07738
H  -6.626231 -1.295255 -1.778835
H  2.442363 -2.030973 -2.775707
H  3.37395 4.334552 -1.623711
H  2.33121 -5.118685 0.296766
H  2.500852 -4.472421 -2.143159
H  -7.612878 0.925353 -1.673046
