program: Gaussian 09
title: 000213062
version: EM64L-G09RevD.01
frameworkgroup: C1[X(C12H17NO3)]
method: RPBEPBE
basis: SDD
operation: Freq
keyword: #p
keyword: freq=noraman
keyword: PBEPBE/SDD
title: #p freq=noraman PBEPBE/SDD
converged: YES YES NO NO
title: Mulliken charges:
elementType: O O O N C C C C C C C C C C C C H H H H H H H H H H H H H H H H H
charge: -0.315815 -0.434561 -0.272490 -0.460012 -0.051564 -0.390037 -0.314777 -0.372136 -0.698096 0.249463 0.480720 -0.443683 -0.356582 -0.195730 -0.210277 -0.257468 0.201560 0.228776 0.201073 0.249222 0.234821 0.216372 0.204574 0.210735 0.206565 0.225785 0.332415 0.328273 0.221895 0.299179 0.226407 0.226457 0.228938
chargesum: 0.00000
title: Mulliken charges with hydrogens summed into heavy atoms:
elementType: O O O N C C C C C C C C C C C C
charge: -0.315815 -0.102147 -0.272490 -0.131739 0.149996 0.039811 0.169266 0.048810 -0.055012 0.249463 0.480720 -0.221788 -0.057403 0.030677 0.016181 -0.028530
polarizability: 2.17229565e+02 1.44446737e+01 1.07051864e+02 -6.55620804e+00 1.73043513e+01 1.28334482e+02
1716.lowfreq: -13.0949 -8.9403 -5.0915 -0.0011 -0.0009 -0.0006 19.0244 22.0636 34.1232
frequency: 18.3971 21.5909 34.0993 56.2678 69.6680 87.0291 99.1948 131.1558 177.0897 182.0831 226.3405 244.2484 257.4150 285.7665 322.8223 340.2370 354.5007 407.3139 430.0596 464.6536 500.2721 508.8335 605.2905 618.1546 638.4407 679.7842 692.6960 697.3832 752.9778 766.1078 817.1586 828.1831 840.9398 884.3798 908.6715 913.2725 935.0409 969.0092 971.2527 984.3467 995.9015 1004.8597 1011.5117 1031.8608 1041.5764 1074.0057 1089.9707 1133.8335 1145.8877 1159.8607 1172.6358 1181.9776 1189.7772 1237.6661 1258.7724 1268.4365 1304.3678 1308.9166 1325.5674 1337.1230 1357.5744 1365.7583 1372.2986 1386.3010 1393.1395 1433.5428 1463.9041 1467.1257 1471.0250 1480.0656 1485.2966 1485.9244 1516.8500 1600.6464 1617.6985 1665.6026 2959.4355 2975.3515 2980.5581 2982.5909 3016.4410 3036.5311 3064.2237 3071.7893 3075.7930 3098.3809 3113.3258 3132.1668 3144.2728 3165.1209 3189.5670 3541.9271 3562.5466
redmass: 3.9683 4.9729 3.2433 2.2475 7.5333 4.3652 3.1751 4.2087 3.6194 1.8045 2.2502 3.2725 3.4656 2.5298 3.2856 1.3558 4.4933 2.9194 3.0319 2.9045 4.1195 2.8423 5.5946 5.8689 1.3275 6.6346 3.6673 2.4119 1.3090 1.6646 2.4940 3.1433 1.2661 2.4129 3.0081 1.4311 2.5485 1.5603 1.3552 6.1188 1.3050 2.3417 4.6688 2.2829 2.9851 1.3578 1.5586 2.2780 2.1314 3.3619 1.0507 1.6483 1.1128 1.2142 2.0911 1.1995 1.2206 1.1809 1.3999 1.2892 1.4362 1.3696 1.2817 6.5441 1.2069 2.3616 1.0769 1.0821 1.0758 1.0526 1.0661 2.1799 2.2599 5.2991 6.0268 8.1040 1.0813 1.0408 1.0593 1.0646 1.0591 1.0976 1.1004 1.1004 1.0987 1.1063 1.0883 1.0869 1.0935 1.0996 1.0953 1.0759 1.0661
irintensity: 1.0978 0.3062 0.1150 0.6403 4.1714 0.6060 2.5128 1.7784 2.7696 0.8002 2.1789 3.4007 11.3170 57.2870 0.9232 145.6226 30.3096 0.0117 0.2623 2.7874 7.5225 25.5087 0.6760 3.8966 27.2823 15.3192 6.1231 78.6241 12.6146 106.2117 3.3984 5.9255 0.4175 5.8425 16.8873 13.9244 50.0298 60.6228 0.0789 2.9474 2.5433 28.3019 254.0807 37.4994 10.2862 20.9696 29.5683 9.3018 5.1939 435.0067 0.6498 5.7272 5.6811 6.9884 5.2592 2.8614 5.4865 9.2063 55.9871 8.7300 2.0115 5.7919 7.8940 50.0578 13.4201 113.9529 15.7016 6.3200 6.8177 11.7405 13.2701 12.1956 536.6138 30.6626 104.7216 219.4271 12.0749 12.6735 77.7696 39.5344 20.6795 6.7070 31.8540 71.8440 42.9941 10.0917 13.9701 0.6631 31.5268 23.5438 5.8857 28.3363 7.5571
temp: 298.150 k
press: 1.00000 atm
elementType: 8 8 8 7 6 6 6 6 6 6 6 6 6 6 6 6 1 1 1 1 1 1 1 1 1 1 1 1 1 1 1 1 1
symmnumber: 1
zpe: 715782.0 jmol-1
zpe.correction: 0.272627 hartree
zpe.thermalcorrener: 0.289469 hartree
zpe.thermalcorrenthalpy: 0.290413 hartree
zpe.thermalcorrgfe: 0.225069 hartree
zpe.sumelectzpe: -746.684427 hartree
zpe.sumelectthermal: -746.667585 hartree
zpe.sumelectthermalent: -746.666641 hartree
zpe.sumelectthermalfe: -746.731985 hartree
dipole: -0.0979 0.6430 -3.2446
dipole: 3.3092
quadrupole: -89.4560 -99.0321 -91.9685
quadrupole: -6.1658 3.3557 6.0781
quadrupole: 4.0295 -5.5465 1.5170 -6.1658 3.3557 6.0781
hfenergy: -746.957054 hartree
pointgroup: C01 [X(C12H17N1O3)]
dipole: -0.0752068 1.1105379 -0.6753142 debye
polarizability: 214.2574502|21.9387035|103.6583304|10.6429811|-10.8646601|134.7001303 unknown
InChI: InChI=1S/C12H17NO3/c1-2-10(8-14)9-16-12(15)13-11-6-4-3-5-7-11/h3-7,10,13-14H,2,8-9H2,1H3
charge 0 multiplicity 1
33 atoms
O  -1.168298 -0.531754 -1.021955
O  -5.302964 -1.275336 -1.466179
O  -0.099284 -1.046658 1.024093
N  1.012839 -0.01632 -0.801116
C  -3.482277 0.02755 -0.3159
C  -3.157476 0.891701 0.931448
C  -2.453015 -1.0978 -0.527789
C  -4.89333 -0.601114 -0.220947
C  -3.907612 2.241793 0.976652
C  -0.068017 -0.576133 -0.140364
C  2.337364 0.166751 -0.316211
C  3.274135 0.772845 -1.196324
C  2.743551 -0.223454 0.987488
C  4.602992 0.988004 -0.77906
C  4.078394 0.000329 1.388692
C  5.01519 0.603429 0.518345
H  -3.453368 0.683573 -1.213299
H  -2.069093 1.08716 0.952149
H  -3.376581 0.304871 1.847028
H  -2.791435 -1.790975 -1.31532
H  -2.257389 -1.647306 0.411568
H  -4.910689 -1.402466 0.539024
H  -5.636761 0.168302 0.069736
H  -3.672877 2.85286 0.08447
H  -5.005006 2.110657 1.015692
H  -3.61383 2.824411 1.868506
H  -5.371859 -0.597544 -2.185345
H  0.81493 0.293704 -1.75506
H  2.961551 1.074605 -2.204377
H  2.021808 -0.690946 1.660339
H  5.314996 1.456029 -1.467846
H  4.386534 -0.30324 2.395589
H  6.047479 0.77047 0.843273
