program: Gaussian 09
title: 000213061
version: EM64L-G09RevD.01
frameworkgroup: C1[X(C12H17NO4)]
method: RPBEPBE
basis: SDD
operation: Freq
keyword: #p
keyword: freq=noraman
keyword: PBEPBE/SDD
title: #p freq=noraman PBEPBE/SDD
converged: YES YES NO NO
title: Mulliken charges:
elementType: O O O O N C C C C C C C C C C C C H H H H H H H H H H H H H H H H H
charge: -0.356224 -0.304277 -0.438241 -0.278945 -0.613965 0.325200 -0.366829 -0.420255 -0.402312 -0.719244 0.317103 -0.344734 -0.360738 0.298541 -0.213347 -0.209970 -0.244376 0.230579 0.216927 0.242450 0.281834 0.222803 0.220823 0.234501 0.216276 0.222149 0.354072 0.275074 0.245335 0.227419 0.228520 0.230065 0.339698 0.344089
chargesum: 0.00000
title: Mulliken charges with hydrogens summed into heavy atoms:
elementType: O O O O N C C C C C C C C C C C C
charge: -0.356224 -0.304277 -0.084170 -0.278945 0.069822 0.325200 0.080677 0.104029 0.041314 -0.046318 0.317103 -0.069660 -0.115403 0.298541 0.014072 0.018550 -0.014311
polarizability: 1.85799519e+02 3.75952082e+00 1.55550401e+02 6.66433540e+00 -3.02297142e-01 1.01585955e+02
1716.lowfreq: -14.7503 -11.1130 -5.0313 0.0002 0.0005 0.0008 28.1483 36.4433 43.3808
frequency: 28.0993 36.2580 43.0714 45.0338 65.8563 75.3245 82.6895 132.0019 156.6462 199.3758 212.5621 225.2399 269.4452 282.6184 300.7003 338.5650 369.7607 409.5006 417.1463 435.4278 461.9794 497.2448 511.2255 518.9291 524.7454 559.4719 610.4733 613.4944 628.5859 681.5352 698.1933 703.6379 770.7105 776.3052 792.8972 794.8506 849.4871 852.6531 908.4075 926.0900 962.2820 977.1401 987.5955 993.4955 994.0844 1017.3352 1021.4031 1029.2659 1042.1029 1061.1440 1072.3415 1084.2897 1157.9377 1168.5659 1171.6709 1186.7597 1197.5003 1215.6330 1265.3152 1299.8131 1303.5633 1315.2139 1330.4198 1342.0155 1372.9801 1374.1136 1383.1957 1397.4994 1435.6465 1446.1892 1458.3744 1461.1510 1471.2197 1483.2558 1488.6219 1588.9375 1590.0001 1599.5956 1693.8193 2987.6053 2989.6055 2993.3440 3020.6926 3049.9250 3079.3540 3087.8623 3091.2698 3101.0300 3126.7814 3135.8907 3152.2189 3161.4862 3170.2077 3530.5464 3558.0257 3715.1274
redmass: 3.5228 3.7319 3.0646 6.9507 4.7707 4.3280 4.5236 2.9919 5.2151 5.8166 1.6234 4.3695 2.0869 3.7079 2.3038 2.4466 3.5933 3.9497 2.9878 4.1840 1.6319 1.8718 1.2152 1.6270 1.5737 3.5975 6.3685 4.5490 4.4939 4.5307 10.7902 1.9063 1.5986 1.7075 2.7187 3.0755 1.2439 4.9458 1.7306 1.4292 2.0768 1.3535 5.3130 1.3312 3.6508 3.8846 2.0721 1.7966 2.7562 2.0213 1.5311 2.2873 2.0050 1.1726 1.3572 1.9061 2.1293 1.7011 1.1544 2.1237 1.4716 1.3550 1.4292 1.3143 1.4317 7.8348 1.3014 1.1950 2.1722 1.1089 1.0776 1.0830 2.2346 1.0549 1.0449 4.3265 1.3272 6.0409 7.3309 1.0365 1.0611 1.0658 1.0574 1.0997 1.0988 1.1006 1.1056 1.0967 1.0848 1.0891 1.0931 1.0960 1.1009 1.0648 1.0447 1.1058
irintensity: 0.4151 0.1196 1.2712 3.3395 5.0789 1.1640 1.4953 9.4666 1.4455 2.7760 1.6673 5.1386 0.3936 6.4379 0.7768 12.9147 3.3908 10.7089 1.3688 7.3585 100.4731 23.0467 287.3376 61.6398 19.5439 24.4822 0.1577 0.6168 9.2708 18.4969 38.1266 38.7023 29.6804 22.2315 36.0496 24.8073 0.1130 95.9977 7.6605 10.7107 98.8291 0.4995 4.7375 1.1751 72.9249 114.4853 11.2953 23.6632 59.1201 7.4999 9.8030 47.2288 63.0860 2.0346 3.5427 24.7754 61.4806 16.1680 2.9547 308.9386 58.8718 4.8399 30.8782 56.1528 57.3654 0.1854 28.5843 13.8451 5.0387 26.0596 2.3401 9.6334 85.6969 13.0625 12.2324 6.5278 115.5157 36.8521 323.2372 32.8952 30.3891 32.9234 24.3993 0.7974 38.9330 41.5847 0.9718 17.4814 1.1293 12.4224 25.1556 12.4729 13.1414 13.0228 68.0087 56.0533
temp: 298.150 k
press: 1.00000 atm
elementType: 8 8 8 8 7 6 6 6 6 6 6 6 6 6 6 6 6 1 1 1 1 1 1 1 1 1 1 1 1 1 1 1 1 1
symmnumber: 1
zpe: 724929.2 jmol-1
zpe.correction: 0.276111 hartree
zpe.thermalcorrener: 0.293902 hartree
zpe.thermalcorrenthalpy: 0.294846 hartree
zpe.thermalcorrgfe: 0.228621 hartree
zpe.sumelectzpe: -821.816022 hartree
zpe.sumelectthermal: -821.798231 hartree
zpe.sumelectthermalent: -821.797287 hartree
zpe.sumelectthermalfe: -821.863512 hartree
dipole: -1.8381 -3.1692 -0.8316
dipole: 3.7568
quadrupole: -98.9067 -90.9791 -104.6769
quadrupole: -12.0274 5.7420 -8.2938
quadrupole: -0.7191 7.2085 -6.4893 -12.0274 5.7420 -8.2938
hfenergy: -822.092133 hartree
pointgroup: C01 [X(C12H17N1O4)]
dipole: 0.6030183 -1.3435003 0.1265499 debye
polarizability: 184.867881|-7.4171057|155.4049018|5.3072619|7.7937094|102.6630922 unknown
InChI: InChI=1S/C12H17NO4/c1-2-12(8-14,9-16-11(13)15)17-10-6-4-3-5-7-10/h3-7,14H,2,8-9,13H2,1H3
charge 0 multiplicity 1
34 atoms
O  0.445371 0.640896 -0.900047
O  -1.741301 -1.136222 0.022291
O  -1.034418 2.843235 -1.555158
O  -3.907506 -0.439887 0.672069
N  -3.554311 -2.14168 -0.906969
C  -0.5733 1.085849 0.134975
C  0.114833 2.081114 1.10536
C  -1.150288 -0.111027 0.911962
C  -1.628388 1.76083 -0.770976
C  -0.791775 2.678062 2.206431
C  1.58726 -0.097827 -0.498448
C  1.504453 -1.502253 -0.331491
C  2.831379 0.56679 -0.379375
C  -3.155734 -1.175602 -0.013387
C  2.673106 -2.235314 -0.025852
C  3.995105 -0.177415 -0.080809
C  3.919491 -1.578152 0.102989
H  0.511449 2.902632 0.480433
H  0.981633 1.575751 1.574735
H  -0.355085 -0.630878 1.471451
H  -1.934306 0.236686 1.60746
H  -2.4266 2.218883 -0.166402
H  -2.07232 0.994302 -1.436182
H  -1.668457 3.194721 1.777447
H  -1.156733 1.914603 2.916929
H  -0.223699 3.424418 2.790257
H  -0.251813 2.446536 -2.021105
H  0.536857 -1.997794 -0.46174
H  2.87572 1.649479 -0.537212
H  2.611053 -3.32215 0.101193
H  4.959153 0.336332 0.005854
H  4.823244 -2.152051 0.335031
H  -2.865621 -2.675637 -1.431432
H  -4.548554 -2.299327 -1.04378
