program: Gaussian 09
title: 000213108
version: EM64L-G09RevD.01
frameworkgroup: C1[X(C22H29NO2)]
method: RPBEPBE
basis: SDD
operation: Freq
keyword: #p
keyword: freq=noraman
keyword: PBEPBE/SDD
title: #p freq=noraman PBEPBE/SDD
converged: YES YES NO NO
title: Mulliken charges:
elementType: O O N C C C C C C C C C C C C C C C C C C C C C C H H H H H H H H H H H H H H H H H H H H H H H H H H H H H
charge: -0.270508 -0.243037 -0.111067 -0.048197 0.046437 -0.398594 0.447567 0.358836 0.185597 -0.780446 -0.337359 -0.325413 -0.716822 -0.387348 -0.353435 -0.379834 -0.396780 -0.673581 -0.671015 -0.244317 -0.247480 -0.247629 -0.244623 -0.248251 -0.244629 0.235720 0.205849 0.232171 0.225552 0.236896 0.244173 0.241027 0.189163 0.206817 0.189136 0.237390 0.213415 0.229659 0.255641 0.274434 0.233081 0.249413 0.210018 0.223994 0.204834 0.208435 0.223663 0.208116 0.223985 0.227605 0.222900 0.224156 0.226657 0.228031
chargesum: 0.00000
title: Mulliken charges with hydrogens summed into heavy atoms:
elementType: O O N C C C C C C C C C C C C C C C C C C C C C C
charge: -0.270508 -0.243037 -0.111067 -0.048197 0.282156 0.039426 0.447567 0.358836 0.185597 -0.073826 0.092831 0.070541 -0.036359 -0.131707 -0.079001 -0.146754 -0.147367 -0.034735 -0.030801 -0.020333 -0.019876 -0.024729 -0.020467 -0.021594 -0.016598
polarizability: 2.70855163e+02 -1.26572093e+01 2.67335593e+02 1.25373235e+01 8.43936303e+00 2.04529220e+02
1716.lowfreq: -5.3080 -3.2656 -0.0007 -0.0006 -0.0004 3.3179 13.4780 20.4559 22.4785
frequency: 13.2593 20.4388 22.4444 32.0244 44.2809 52.5428 69.0999 74.5270 84.8206 92.2087 99.7596 138.2336 160.4693 163.7985 185.5604 213.2452 223.9814 233.4833 239.6518 244.6729 269.6574 284.7569 294.7561 298.0207 300.9862 325.8054 344.1983 357.7915 389.5763 401.4559 404.3321 419.3607 437.5856 457.6200 466.5340 491.2146 523.1255 561.7734 598.7264 616.4305 616.9508 651.3304 696.4476 702.7845 707.1779 734.8365 746.4130 771.2270 777.8326 795.0330 796.7518 805.1829 838.8783 850.4889 856.4503 866.3709 883.4271 915.4647 920.9324 934.2464 941.5638 975.7039 982.3013 990.7942 991.0672 992.8703 993.1751 997.5474 1022.3199 1025.1743 1035.8287 1056.1982 1063.0368 1067.4657 1072.3444 1077.2599 1082.3600 1084.6362 1088.7362 1103.2542 1129.0193 1154.7972 1168.0651 1172.6660 1173.9688 1189.7780 1196.7696 1197.1854 1199.0766 1206.2824 1231.7025 1265.9250 1281.7086 1293.0087 1311.8829 1322.0492 1325.4507 1335.7898 1360.7555 1372.4053 1374.9692 1377.1350 1379.6638 1384.8689 1388.2956 1389.1463 1390.5537 1432.5570 1435.7320 1459.6839 1463.2622 1467.8447 1471.6056 1472.3251 1475.3792 1479.6293 1482.0398 1482.4984 1484.1268 1487.4263 1490.4791 1494.1200 1588.2903 1591.2181 1599.1564 1609.5204 1613.7739 2857.1955 2868.6388 2904.6605 2982.0289 2982.4981 2991.4914 2997.8019 3032.3058 3034.2396 3037.4282 3049.3565 3074.6669 3076.3190 3089.0385 3089.3777 3091.7612 3093.0611 3101.8496 3112.6036 3121.0653 3123.1190 3128.8603 3132.0666 3141.6980 3145.2694 3149.8585 3157.1836 3163.4442 3168.4052
redmass: 4.2037 4.3886 3.7156 3.7428 4.1451 3.9887 3.4436 3.2618 3.2988 2.8288 2.7950 5.8174 2.8486 1.6292 3.4694 1.3868 2.7186 1.8496 1.8488 1.7642 3.4330 1.7645 2.8054 2.6028 3.5463 1.4393 2.9944 3.5977 2.8030 2.8040 2.8195 3.4731 2.3175 3.3637 3.6304 3.3111 3.4245 3.5895 4.9897 6.3355 6.3336 4.9852 5.3466 1.6703 1.8276 3.7480 2.7565 1.9863 2.5208 1.3997 1.2084 2.0583 2.9987 1.2880 1.2553 2.5988 1.9516 2.2285 1.4321 1.5161 1.4758 1.3932 1.3839 5.9029 3.4682 2.0383 1.6592 1.3205 2.8634 2.4803 2.1441 2.1793 2.0875 2.3559 2.1888 1.9273 1.7814 2.1654 1.6529 2.1202 1.7038 2.2727 2.9361 1.0660 1.1024 3.2014 1.4209 1.6145 1.1556 2.2436 3.6178 1.2807 1.1736 1.2362 1.3072 1.3738 1.3198 1.3953 1.3415 1.3621 6.4242 1.3033 7.5504 1.2430 1.2357 1.2376 1.2528 2.2196 2.2295 1.0631 1.0523 1.0474 1.0770 1.1024 1.0494 1.5276 1.0549 1.0583 1.9188 1.3317 1.0711 1.0820 5.9418 6.3105 9.5512 6.1114 6.3942 1.0722 1.0716 1.0695 1.0356 1.0357 1.0357 1.0354 1.0855 1.0878 1.0881 1.0911 1.0985 1.0979 1.1004 1.1002 1.0999 1.0992 1.0999 1.1003 1.0843 1.0846 1.0875 1.0884 1.0921 1.0935 1.0959 1.0962 1.1014 1.0986
irintensity: 0.2186 0.2692 0.1471 0.0262 0.0123 0.5482 0.0466 0.6375 0.8281 0.5003 0.1850 1.4643 1.0652 1.6855 2.5791 0.4064 2.7090 1.2667 0.2548 0.3796 1.6367 1.8234 2.6268 0.3913 1.2454 1.0657 2.2088 4.0153 5.0423 0.0320 0.0530 7.1130 2.4168 4.9711 4.3246 5.2391 9.0653 19.4779 6.2606 0.5436 0.0562 14.0546 3.1168 45.3411 71.2054 2.3799 6.9994 34.0694 19.5971 11.4301 16.3877 6.2638 5.9579 0.2295 0.3657 5.3047 2.7870 9.4985 2.0450 0.6897 2.6489 0.2678 0.8584 0.4736 0.2232 2.2253 1.0679 0.4443 71.1720 32.3223 210.1314 76.7608 72.1220 24.3866 50.4566 20.7074 31.7770 3.4341 3.4912 58.2210 11.0320 6.8650 128.0034 1.9838 6.9936 21.7670 7.0702 9.3429 1.6107 38.2051 16.0381 10.6736 6.0812 24.5267 6.5434 2.5185 0.3854 2.2727 2.5021 1.3352 1.4994 5.0924 0.2837 5.2020 28.7877 38.6389 13.6759 18.0041 4.8041 5.3558 9.2165 7.0986 9.0847 3.4526 3.7623 31.7082 9.0070 15.0882 6.8071 28.1907 11.3095 8.3809 0.1778 9.7084 99.9622 8.6806 23.6822 56.1046 121.2823 97.7385 33.6358 27.1175 18.0723 15.8343 7.6297 2.5766 14.9608 19.8007 27.1374 93.2075 25.6774 49.0663 21.1419 38.8678 18.0433 25.5879 1.5564 0.4050 2.1464 7.8584 25.0611 19.9194 38.7351 29.1314 21.2915 15.3742
temp: 298.150 k
press: 1.00000 atm
elementType: 8 8 7 6 6 6 6 6 6 6 6 6 6 6 6 6 6 6 6 6 6 6 6 6 6 1 1 1 1 1 1 1 1 1 1 1 1 1 1 1 1 1 1 1 1 1 1 1 1 1 1 1 1 1
symmnumber: 1
zpe: 1200542.0 jmol-1
zpe.correction: 0.457262 hartree
zpe.thermalcorrener: 0.483251 hartree
zpe.thermalcorrenthalpy: 0.484195 hartree
zpe.thermalcorrgfe: 0.398368 hartree
zpe.sumelectzpe: -1059.050503 hartree
zpe.sumelectthermal: -1059.024514 hartree
zpe.sumelectthermalent: -1059.023570 hartree
zpe.sumelectthermalfe: -1059.109397 hartree
dipole: -0.9061 -0.3093 -1.2751
dipole: 1.5945
quadrupole: -138.3085 -141.9674 -149.4357
quadrupole: -6.3665 1.9302 -0.2068
quadrupole: 4.9287 1.2698 -6.1985 -6.3665 1.9302 -0.2068
hfenergy: -1059.5077652 hartree
pointgroup: C01 [X(C22H29N1O2)]
dipole: -0.327129 -0.2952649 0.4464687 debye
polarizability: 270.6275538|19.9635153|224.2967416|-0.5619279|29.0822031|247.7956809 unknown
InChI: InChI=1S/C22H29NO2/c1-5-23(6-2)17-18(3)25-21(24)22(4,19-13-9-7-10-14-19)20-15-11-8-12-16-20/h7-16,18H,5-6,17H2,1-4H3
charge 0 multiplicity 1
54 atoms
O  -0.817525 -0.161446 1.082678
O  -0.394267 0.445977 -1.120683
N  -4.381316 -0.054408 -0.163995
C  1.448997 -0.521068 0.264676
C  -2.211594 0.402641 0.956602
C  -3.124292 -0.673414 0.318125
C  2.126803 -1.086966 -1.008014
C  2.15652 0.774098 0.759617
C  -0.000363 -0.052544 -0.038349
C  1.452289 -1.652349 1.331541
C  -4.238662 0.512693 -1.536591
C  -5.577212 -0.924622 -0.008771
C  -2.635079 0.81191 2.36361
C  3.531482 -0.982604 -1.168753
C  2.280513 1.87285 -0.133386
C  1.393857 -1.840894 -1.959536
C  2.673359 0.90594 2.070645
C  -5.194154 1.691269 -1.801332
C  -6.059423 -1.030538 1.450231
C  4.186158 -1.605988 -2.254263
C  2.906986 3.068029 0.274755
C  2.044963 -2.462962 -3.047115
C  3.306102 2.103444 2.480527
C  3.445666 -2.349442 -3.200685
C  3.425662 3.189424 1.586089
H  -2.150052 1.273646 0.279312
H  -3.355221 -1.439685 1.080077
H  -2.568905 -1.181839 -0.504459
H  2.491858 -1.944751 1.561816
H  0.933125 -2.541401 0.935249
H  0.940609 -1.343526 2.256493
H  -3.195737 0.860865 -1.652284
H  -4.38839 -0.279333 -2.312908
H  -6.389001 -0.483432 -0.615144
H  -5.395113 -1.948673 -0.423297
H  -3.684467 1.152911 2.328233
H  -2.562216 -0.043184 3.05963
H  -2.004247 1.631325 2.747916
H  4.117371 -0.404302 -0.445799
H  1.879365 1.783432 -1.149329
H  0.306176 -1.929404 -1.868382
H  2.589985 0.080597 2.7835
H  -5.038585 2.090155 -2.821131
H  -5.011216 2.501187 -1.073693
H  -6.255178 1.392747 -1.717221
H  -5.289442 -1.47301 2.108332
H  -6.305891 -0.028106 1.841966
H  -6.960849 -1.66827 1.514078
H  5.272811 -1.509438 -2.359924
H  2.991253 3.903967 -0.428777
H  1.457956 -3.032438 -3.776756
H  3.702829 2.184654 3.49902
H  3.950952 -2.830252 -4.045908
H  3.914148 4.117228 1.904562
