program: Gaussian 09
title: 000213036
version: EM64L-G09RevD.01
frameworkgroup: C1[X(C11H23NO)]
method: RPBEPBE
basis: SDD
operation: Freq
keyword: #p
keyword: freq=noraman
keyword: PBEPBE/SDD
title: #p freq=noraman PBEPBE/SDD
converged: YES YES NO NO
title: Mulliken charges:
elementType: O N C C C C C C C C C C C H H H H H H H H H H H H H H H H H H H H H H H
charge: -0.266406 -0.379398 0.290740 -0.455289 -0.425345 -0.417361 0.166091 -0.400186 -0.376050 -0.716219 -0.697899 -0.700634 -0.617138 0.216105 0.226222 0.163965 0.205553 0.172536 0.210307 0.202389 0.205038 0.214573 0.221471 0.209489 0.234648 0.226718 0.213091 0.211790 0.212771 0.208648 0.205282 0.220174 0.294004 0.276577 0.221655 0.222085
chargesum: 0.00000
title: Mulliken charges with hydrogens summed into heavy atoms:
elementType: O N C C C C C C C C C C C
charge: -0.266406 -0.085395 0.290740 -0.012961 -0.055827 -0.034518 0.166091 0.007241 0.059995 -0.045364 -0.060247 -0.066530 0.103178
polarizability: 1.43733433e+02 -1.05004032e+00 1.26620351e+02 -3.64855202e+00 2.77219485e-01 1.15210319e+02
1716.lowfreq: -9.6335 -0.0004 0.0005 0.0008 9.7971 13.9308 32.2979 51.7051 62.2093
frequency: 31.9714 51.5049 62.1062 68.2615 79.0921 92.7391 103.7548 107.4988 148.4531 172.4748 210.1555 219.0974 232.8546 248.9772 282.6586 296.8510 311.2349 324.9662 344.7771 348.0938 375.1909 478.1658 519.9791 560.8775 622.6802 712.2821 732.3985 737.8386 776.2504 784.0140 830.0227 858.1485 888.5547 894.3475 929.8668 968.7680 1008.1795 1031.3370 1041.1858 1054.2779 1059.8798 1080.1781 1093.4109 1111.3078 1120.3651 1133.0554 1160.6011 1165.3084 1189.8282 1220.7697 1240.8151 1246.0692 1274.8781 1286.4636 1291.8506 1298.8196 1314.4730 1328.8734 1355.3330 1356.3897 1387.2672 1389.5935 1394.5023 1411.9304 1455.0713 1464.4457 1466.6960 1469.1582 1474.0843 1475.6733 1477.7937 1478.8558 1482.8942 1486.0461 1487.6312 1489.3095 1495.3349 1514.3712 1600.2318 2947.6164 2962.2166 2967.1601 2969.8167 2972.5389 2973.9631 2982.9699 2984.2296 2999.5086 3007.2757 3011.6370 3017.7887 3034.9555 3051.3691 3054.3602 3067.6944 3071.1977 3071.2619 3071.7527 3074.4783 3084.9353 3106.8995 3563.2800
redmass: 4.6204 3.1386 1.7841 2.0231 2.2146 2.1424 2.4116 1.2485 2.8282 1.9750 1.6787 1.1298 1.3778 2.0056 2.1631 2.3296 3.3730 2.4148 2.9072 2.8920 3.8063 3.3146 3.0507 1.1558 2.5071 2.2177 1.4558 1.1562 2.8194 1.4331 1.6289 1.5736 1.5907 1.8871 1.6100 1.8752 1.8833 2.8151 2.5813 2.5484 1.9323 1.6318 2.2768 2.2398 1.2867 1.6848 2.2218 2.4034 3.2350 1.9645 1.3606 1.2719 1.2174 1.2927 1.1999 1.1850 1.3549 1.4343 1.4892 1.5461 1.2123 1.2120 1.2111 1.1823 1.3043 1.0750 1.0640 1.0683 1.0431 1.0526 1.0523 1.0427 1.0635 1.0746 1.0473 1.0822 1.0684 1.3878 6.9863 1.0630 1.0620 1.0583 1.0361 1.0373 1.0350 1.0611 1.0372 1.0934 1.0656 1.0952 1.0950 1.1008 1.1024 1.1005 1.1012 1.1000 1.0997 1.0996 1.0993 1.0994 1.0976 1.0768
irintensity: 8.6556 0.2982 0.0062 0.0387 0.0108 0.1995 0.6888 0.3636 1.9217 1.7978 1.2764 0.0193 0.5087 0.9098 0.1908 1.1728 2.4240 0.8587 3.2549 5.7261 9.0908 2.8342 9.4930 113.3122 1.6845 10.0167 5.8799 5.6080 1.0086 8.5024 0.4204 3.7211 8.7792 3.2540 3.2424 2.9447 11.1588 9.9643 2.8774 0.9852 2.7312 1.1282 3.9452 5.0045 0.0001 51.1414 3.7103 4.5199 21.7096 41.1461 7.0085 1.1488 0.6109 0.2649 0.2700 2.0697 0.6717 0.4115 0.3206 1.3628 11.4039 14.3141 14.2718 27.9508 80.8077 0.4562 2.8559 4.0515 11.2062 2.3248 2.4067 12.0002 10.7345 4.5129 13.2241 33.8125 6.5294 105.6255 135.2262 15.6402 23.5443 63.5338 59.4531 40.7483 72.6644 24.0288 27.5488 11.6893 14.7607 17.2776 33.9347 16.8739 34.3113 13.5837 76.3838 12.6539 65.7642 115.1844 44.2101 47.2165 1.8363 8.0409
temp: 298.150 k
press: 1.00000 atm
elementType: 8 7 6 6 6 6 6 6 6 6 6 6 6 1 1 1 1 1 1 1 1 1 1 1 1 1 1 1 1 1 1 1 1 1 1 1
symmnumber: 1
zpe: 848274.1 jmol-1
zpe.correction: 0.323091 hartree
zpe.thermalcorrener: 0.340426 hartree
zpe.thermalcorrenthalpy: 0.341370 hartree
zpe.thermalcorrgfe: 0.277616 hartree
zpe.sumelectzpe: -561.872173 hartree
zpe.sumelectthermal: -561.854838 hartree
zpe.sumelectthermalent: -561.853894 hartree
zpe.sumelectthermalfe: -561.917647 hartree
dipole: -1.0520 0.8667 3.4011
dipole: 3.6641
quadrupole: -74.9848 -83.9731 -88.7858
quadrupole: -0.4349 -3.7214 -3.1225
quadrupole: 7.5964 -1.3918 -6.2046 -0.4349 -3.7214 -3.1225
hfenergy: -562.1952636 hartree
pointgroup: C01 [X(C11H23N1O1)]
dipole: -0.3644807 -0.3411181 -1.3523704 debye
polarizability: 143.3792661|1.9986124|126.7888961|4.2448314|0.7503519|115.3959417 unknown
InChI: InChI=1S/C11H23NO/c1-5-8-11(7-3,9-6-2)10(13)12-4/h12H,5-9H2,1-4H3
charge 0 multiplicity 1
36 atoms
O  -1.187919 0.640268 1.766791
N  -2.378155 0.148632 -0.158464
C  0.115375 0.223524 -0.320659
C  1.317722 0.524664 0.626538
C  0.200213 -1.225793 -0.912783
C  0.065413 1.233618 -1.520248
C  -1.188999 0.359167 0.528085
C  2.724272 0.402299 -0.0014
C  0.21518 -2.375124 0.11953
C  -0.103337 2.717473 -1.131468
C  3.831055 0.776697 1.010023
C  0.220099 -3.764221 -0.55488
C  -3.690853 0.231492 0.492169
H  1.192031 1.5423 1.041151
H  1.249416 -0.14174 1.506086
H  -0.651317 -1.388897 -1.60839
H  1.110285 -1.290916 -1.543087
H  -0.759675 0.945167 -2.205048
H  0.993145 1.109799 -2.112744
H  2.8115 1.060223 -0.889217
H  2.898727 -0.632146 -0.358791
H  1.10546 -2.282867 0.770739
H  -0.665929 -2.289334 0.785566
H  -0.187603 3.348269 -2.035522
H  -1.012865 2.873206 -0.522871
H  0.75763 3.086128 -0.546488
H  3.789752 0.122664 1.901346
H  3.711112 1.819832 1.358574
H  4.838416 0.680966 0.56435
H  1.103966 -3.887176 -1.209546
H  -0.681978 -3.908068 -1.179808
H  0.241982 -4.575003 0.196158
H  -2.339455 -0.070643 -1.154074
H  -3.514436 0.467761 1.553847
H  -4.236536 -0.72833 0.424158
H  -4.313893 1.029412 0.046175
