program: Gaussian 09
title: 000213067
version: EM64L-G09RevD.01
frameworkgroup: C1[X(C15H22N2O4)]
method: RPBEPBE
basis: SDD
operation: Freq
keyword: #p
keyword: freq=noraman
keyword: PBEPBE/SDD
title: #p freq=noraman PBEPBE/SDD
converged: YES YES NO NO
title: Mulliken charges:
elementType: O O O O N N C C C C C C C C C C C C C C C H H H H H H H H H H H H H H H H H H H H H H
charge: -0.329695 -0.302661 -0.267251 -0.321240 -0.477023 -0.611467 0.362065 -0.066007 -0.345781 -0.378950 -0.787156 -0.741830 -0.747621 0.229152 0.332832 0.464242 -0.449275 -0.355183 -0.196036 -0.213363 -0.260529 0.222350 0.227399 0.240641 0.269572 0.217276 0.221309 0.220232 0.246333 0.209713 0.237563 0.214723 0.215969 0.219856 0.223249 0.385988 0.343770 0.338554 0.240606 0.294744 0.223694 0.223395 0.225841
chargesum: 0.00000
title: Mulliken charges with hydrogens summed into heavy atoms:
elementType: O O O O N N C C C C C C C C C C C C C C C
charge: -0.329695 -0.302661 -0.267251 -0.321240 -0.091035 0.070857 0.362065 0.156343 0.122259 0.107899 -0.099282 -0.079830 -0.088547 0.229152 0.332832 0.464242 -0.208670 -0.060439 0.027658 0.010032 -0.034688
polarizability: 2.75495975e+02 1.60661308e+01 1.69717602e+02 -2.03473763e+00 1.39496992e+01 1.38972047e+02
1716.lowfreq: -13.1840 -8.7059 -0.0006 0.0003 0.0006 4.9359 21.9846 31.5097 47.6938
frequency: 21.5245 31.2919 47.5917 52.5381 67.6822 73.1543 81.3617 99.5419 125.6531 140.2920 156.5937 172.3593 205.6904 212.7646 219.5944 232.0678 253.0383 263.4629 268.4433 291.1121 318.3405 338.2703 359.4947 368.6806 389.8838 409.1303 440.3994 468.5102 496.8282 505.6736 514.7266 526.8557 572.3662 600.2077 607.2791 615.5799 676.7441 687.9534 698.3541 702.4005 750.5975 764.4721 795.4749 812.6773 831.0765 843.3361 853.0489 902.7101 912.7674 915.7719 917.5280 921.5056 946.5069 962.2515 972.8277 981.9394 984.3465 993.2598 1009.5104 1020.6017 1037.0385 1057.8381 1059.8990 1089.2431 1115.9979 1145.5533 1162.6443 1171.6871 1173.0259 1189.8288 1193.2903 1227.7146 1241.3204 1272.0182 1276.1047 1310.3262 1322.8087 1326.4309 1334.3298 1354.2337 1372.6798 1384.4303 1385.7213 1389.3188 1404.1447 1438.2605 1457.0618 1468.6879 1470.6126 1478.9951 1484.4539 1486.8738 1489.5222 1490.5645 1497.0843 1540.8381 1585.6321 1603.6573 1618.4946 1654.8322 1676.4673 2972.0108 2977.9844 2981.0738 2985.9426 2995.2347 3035.5453 3065.1327 3068.8169 3072.8073 3077.0747 3079.1681 3081.4304 3085.6491 3107.9276 3120.6875 3130.7890 3143.0075 3162.9521 3185.1142 3387.2525 3555.1032 3712.4241
redmass: 5.0009 4.4819 4.5665 4.5408 3.5363 4.2391 5.6236 4.0077 6.1298 6.2431 3.9988 6.1516 1.1659 3.3997 2.7204 1.3802 1.4038 2.4815 3.3145 2.5697 2.7507 5.5146 3.0032 2.3038 2.8471 2.9416 3.1780 2.5261 2.9450 1.1616 2.9309 1.0871 2.7379 6.4490 4.8791 6.3541 6.9971 4.2972 2.0469 10.2889 2.8653 1.8024 1.8634 3.1659 2.7215 2.2159 1.4794 2.3391 2.3573 1.4489 1.5326 1.8677 1.5068 1.4555 1.3579 1.6817 5.6047 1.3046 5.7509 3.3745 2.9460 1.8766 1.8318 1.5664 2.5379 2.0429 3.5372 1.0619 1.9883 1.1167 1.7033 3.4648 1.3439 1.3804 2.0098 2.0985 1.4481 1.4021 1.5011 1.3474 1.4751 1.3662 2.6065 1.5251 1.2088 2.3665 1.0804 1.0532 1.0663 1.0544 1.0593 1.0549 2.3218 1.0649 1.0483 2.0470 1.2898 4.0295 5.8755 6.9239 5.9349 1.0829 1.0360 1.0361 1.0360 1.0587 1.0580 1.0996 1.1038 1.0989 1.0998 1.0989 1.0988 1.0993 1.1065 1.0862 1.0880 1.0943 1.0995 1.0955 1.0791 1.0447 1.1058
irintensity: 0.5504 3.1970 0.1532 4.4104 1.1905 3.2201 1.8572 1.1064 4.1012 10.6350 2.5658 4.7049 0.8302 1.0144 6.1034 2.0197 6.3852 6.0406 6.9206 1.0569 1.5319 4.4069 5.6156 3.3892 1.7150 0.0112 2.2244 1.1196 6.8198 248.1801 21.0581 68.3355 8.5412 3.8337 2.9987 3.3841 6.7629 19.3006 31.0375 44.0344 6.1794 38.3145 106.5567 30.4136 20.0690 6.2018 26.3435 7.7844 8.9341 21.0199 1.9945 4.1832 8.1778 6.6242 0.1869 24.9954 2.8370 2.1756 101.7220 175.9255 131.8211 89.8964 33.2308 42.1333 2.7530 60.1817 348.0432 4.5744 15.4228 5.4777 0.1141 7.8056 7.9760 8.2327 17.1354 281.5326 19.9468 64.5964 37.5980 1.2198 76.5156 16.0379 48.0141 28.5495 14.3251 71.1560 10.6723 1.9239 30.9545 18.1639 4.0758 3.1991 55.2324 1.4626 25.6789 545.6671 101.6011 92.7751 100.1048 260.3633 342.5732 14.4783 29.0669 19.5949 28.5144 33.1431 40.5567 1.8825 32.9552 76.3801 41.8644 19.2142 34.5196 39.2265 11.6358 7.9788 3.3322 33.1948 27.0692 5.8100 232.6877 64.1561 46.6883
temp: 298.150 k
press: 1.00000 atm
elementType: 8 8 8 8 7 7 6 6 6 6 6 6 6 6 6 6 6 6 6 6 6 1 1 1 1 1 1 1 1 1 1 1 1 1 1 1 1 1 1 1 1 1 1
symmnumber: 1
zpe: 932061.1 jmol-1
zpe.correction: 0.355003 hartree
zpe.thermalcorrener: 0.377086 hartree
zpe.thermalcorrenthalpy: 0.378031 hartree
zpe.thermalcorrgfe: 0.302965 hartree
zpe.sumelectzpe: -993.627250 hartree
zpe.sumelectthermal: -993.605167 hartree
zpe.sumelectthermalent: -993.604223 hartree
zpe.sumelectthermalfe: -993.679289 hartree
dipole: -3.1415 2.9278 -1.4444
dipole: 4.5307
quadrupole: -112.8788 -123.3027 -122.4367
quadrupole: 5.2578 -0.3229 -8.0890
quadrupole: 6.6606 -3.7633 -2.8973 5.2578 -0.3229 -8.0890
hfenergy: -993.9822538 hartree
pointgroup: C01 [X(C15H22N2O4)]
dipole: -1.5040332 -0.9265618 0.2381626 debye
polarizability: 261.6339032|-40.3075979|176.3980504|11.6932329|15.4386039|146.1536704 unknown
InChI: InChI=1S/C15H22N2O4/c1-11(2)15(3,9-20-13(16)18)10-21-14(19)17-12-7-5-4-6-8-12/h4-8,11,17H,9-10,16H2,1-3H3
charge 0 multiplicity 1
43 atoms
O  -0.281559 0.938207 -0.367612
O  -2.403925 -1.236789 -0.139564
O  1.222867 1.764121 1.251636
O  -0.348073 -1.992555 -1.052793
N  1.729839 -0.039883 -0.223641
N  -1.272384 -2.905955 0.892567
C  -2.684029 1.216109 -0.591829
C  -3.994584 1.340396 0.277248
C  -1.461894 1.491192 0.324267
C  -2.554741 -0.206287 -1.203443
C  -2.660063 2.203965 -1.790313
C  -4.047516 2.643778 1.116558
C  -5.295484 1.218891 -0.555083
C  0.950547 0.961875 0.322959
C  -1.255432 -2.0411 -0.17712
C  3.090601 -0.329912 0.056034
C  3.659613 -1.4610 -0.590959
C  3.88528 0.453253 0.935777
C  5.008259 -1.801851 -0.364522
C  5.234563 0.097753 1.149394
C  5.807091 -1.024395 0.507103
H  -3.968913 0.485325 0.985519
H  -1.568419 0.98178 1.301209
H  -1.314024 2.570739 0.499483
H  -1.678436 -0.266842 -1.868461
H  -3.468438 -0.480825 -1.756454
H  -3.394596 1.924622 -2.567231
H  -2.890637 3.233103 -1.462446
H  -1.658017 2.212864 -2.255082
H  -4.028836 3.543588 0.473188
H  -3.2130 2.720697 1.83558
H  -4.986495 2.676218 1.69943
H  -6.170984 1.214317 0.120128
H  -5.337607 0.289273 -1.150211
H  -5.415847 2.07428 -1.245097
H  1.209369 -0.69034 -0.833091
H  -0.500017 -3.556221 1.007421
H  -2.040363 -2.887157 1.559392
H  3.042872 -2.064272 -1.268389
H  3.441628 1.313423 1.442064
H  5.43521 -2.674831 -0.871056
H  5.842558 0.706734 1.828285
H  6.855416 -1.289087 0.681654
