program: Gaussian 09
title: 000213030
version: EM64L-G09RevD.01
frameworkgroup: C1[X(C14H23NO)]
method: RPBEPBE
basis: SDD
operation: Freq
keyword: #p
keyword: freq=noraman
keyword: PBEPBE/SDD
title: #p freq=noraman PBEPBE/SDD
converged: YES YES NO NO
title: Mulliken charges:
elementType: O N C C C C C C C C C C C C C C H H H H H H H H H H H H H H H H H H H H H H H
charge: -0.292598 -0.111980 -0.387568 -0.323539 -0.327977 -0.248493 -0.671800 -0.671770 -0.344380 0.377843 -0.374610 -0.408501 0.438140 -0.392299 -0.375682 -0.809466 0.212520 0.218737 0.203725 0.188585 0.207092 0.189728 0.204019 0.186460 0.211238 0.226079 0.206009 0.208281 0.225574 0.206620 0.202343 0.199090 0.223003 0.274334 0.226078 0.225865 0.223899 0.233464 0.221936
chargesum: 0.00000
title: Mulliken charges with hydrogens summed into heavy atoms:
elementType: O N C C C C C C C C C C C C C C
charge: -0.292598 -0.111980 0.043689 0.068770 0.068843 0.141986 -0.028474 -0.031294 0.057053 0.377843 -0.151607 -0.134166 0.438140 -0.166221 -0.149817 -0.130167
polarizability: 2.21342163e+02 -3.75635733e+00 1.43630930e+02 4.30513587e+00 -1.67415694e+01 1.27507897e+02
1716.lowfreq: -4.5600 -1.8417 -0.0008 -0.0004 -0.0003 11.1172 17.0536 28.3150 40.3856
frequency: 15.5639 26.7185 40.0576 45.2830 48.8097 75.1678 85.2757 95.0352 99.0170 138.4928 159.8954 188.7976 215.1212 232.0409 290.0399 298.8211 301.5001 314.3888 348.3883 405.4968 410.2807 428.1460 451.0324 487.6756 499.7887 550.3354 637.1042 711.1935 743.6274 746.3022 793.9767 796.3152 804.0696 809.7085 826.6881 856.1517 914.3712 940.3689 944.8550 980.9785 986.5385 991.1319 1014.2977 1018.3525 1047.3825 1051.4669 1067.4029 1068.6623 1076.0830 1085.5647 1096.4747 1121.5853 1125.4481 1163.9797 1186.7616 1203.0431 1207.8447 1218.0180 1221.6348 1231.7397 1276.5641 1284.4179 1291.0733 1299.1794 1318.9605 1350.1684 1361.0626 1367.4751 1381.2364 1385.3610 1387.3626 1396.8655 1401.5868 1409.6649 1461.7059 1463.4401 1466.1964 1470.8697 1473.1059 1474.0060 1477.3440 1482.5083 1486.2425 1490.5476 1491.2282 1511.9679 1587.2418 1629.8420 2850.7098 2859.6662 2896.4344 2909.6079 2928.2046 2934.5950 2972.7454 2981.6724 2982.8634 2985.6811 3020.5815 3033.8848 3053.4562 3062.2031 3074.3889 3075.9516 3081.8550 3090.6631 3091.1078 3103.4407 3118.2930 3131.3013 3173.1847
redmass: 3.4741 3.8076 3.3515 1.0505 2.9681 2.6371 2.1761 3.4143 2.2962 2.7458 2.0296 2.4555 1.8459 1.3352 1.8033 2.6467 3.1202 2.5798 2.7204 2.8647 3.5883 3.3306 2.7429 2.4729 3.0352 4.7432 6.9647 3.1009 3.5728 2.7712 1.1796 1.1340 1.2807 1.2084 4.8386 1.2488 1.9188 5.4050 1.3059 1.3797 1.4503 2.2511 2.9291 1.7157 1.5710 4.1497 1.8029 3.1526 1.9327 2.1570 2.9228 1.3263 1.7111 1.3714 1.1320 1.0927 2.2505 3.0679 2.4316 1.6694 1.1146 1.2074 1.2381 1.3459 1.2949 1.7240 1.3488 1.4442 2.3088 1.2410 1.2364 1.2274 2.2910 1.9150 1.0629 1.0545 1.0728 1.0581 1.0825 1.0634 1.0649 1.0648 1.0667 1.0773 1.0719 2.7586 6.1975 6.3761 1.0720 1.0713 1.0546 1.0704 1.0572 1.1040 1.0384 1.0360 1.0360 1.1022 1.0878 1.0872 1.0951 1.0914 1.0983 1.0981 1.0997 1.1004 1.1003 1.0870 1.0900 1.0963 1.0938
irintensity: 0.0201 0.0125 0.2395 0.5694 0.8412 0.1137 0.3827 8.7496 2.8243 1.9630 1.2748 1.2259 2.9100 0.0198 1.3557 0.8184 0.2436 0.8123 0.4478 0.0793 3.7942 5.3636 4.2628 21.1792 5.9966 0.4641 0.3491 0.2779 2.7709 7.1777 11.2042 4.2010 54.9725 3.9698 0.1740 2.2238 0.8096 17.5489 0.3968 0.2304 2.0581 3.3536 17.0252 3.6223 26.8578 63.5662 44.0087 181.7680 17.9979 2.8548 6.9310 8.9615 8.9528 5.6053 7.2853 1.3097 34.1250 1.9835 0.3738 21.4407 1.4941 26.6807 22.8246 8.6509 8.6446 4.2069 1.6851 4.3275 10.0179 26.2036 20.6275 9.2883 1.1245 3.7611 3.6199 9.6815 14.3254 3.5704 14.2340 13.1197 4.1872 6.0951 9.5881 11.3748 11.2549 36.7642 2.4269 0.0370 33.8653 167.8453 41.5539 61.4593 92.8465 50.5730 42.7802 28.9141 30.9020 54.8466 18.8751 18.6197 25.2378 31.9445 45.2241 77.8683 19.5203 36.7643 48.3706 14.8940 26.0090 26.6645 3.5473
temp: 298.150 k
press: 1.00000 atm
elementType: 8 7 6 6 6 6 6 6 6 6 6 6 6 6 6 6 1 1 1 1 1 1 1 1 1 1 1 1 1 1 1 1 1 1 1 1 1 1 1
symmnumber: 1
zpe: 892593.7 jmol-1
zpe.correction: 0.339971 hartree
zpe.thermalcorrener: 0.358690 hartree
zpe.thermalcorrenthalpy: 0.359634 hartree
zpe.thermalcorrgfe: 0.289680 hartree
zpe.sumelectzpe: -675.969024 hartree
zpe.sumelectthermal: -675.950305 hartree
zpe.sumelectthermalent: -675.949361 hartree
zpe.sumelectthermalfe: -676.019315 hartree
dipole: 0.7898 -0.6303 0.0367
dipole: 1.0111
quadrupole: -87.8514 -95.5167 -98.6461
quadrupole: 1.6262 -2.4094 -3.8384
quadrupole: 6.1533 -1.5120 -4.6414 1.6262 -2.4094 -3.8384
hfenergy: -676.3089946 hartree
pointgroup: C01 [X(C14H23N1O1)]
dipole: -0.3170992 -0.2400983 -0.0075431 debye
polarizability: 221.3711503|1.7316163|144.8958608|5.7212331|15.888408|126.2139795 unknown
InChI: InChI=1S/C14H23NO/c1-4-15(5-2)10-11-16-12-14-8-6-13(3)7-9-14/h6-9H,4-5,10-12H2,1-3H3
charge 0 multiplicity 1
39 atoms
O  -0.211776 -0.07766 -0.049239
N  -3.937634 0.211536 0.147292
C  -2.509123 0.567018 0.34436
C  -4.828014 1.39429 0.011185
C  -4.421334 -0.777455 1.149033
C  -1.596535 -0.425366 -0.389545
C  -4.694795 2.087178 -1.358297
C  -5.604489 -1.623261 0.640693
C  0.756537 -0.945028 -0.71587
C  2.166923 -0.541017 -0.32036
C  3.271753 -1.280222 -0.811393
C  2.411741 0.565899 0.524563
C  4.847318 0.187677 0.386123
C  4.591089 -0.9193 -0.464544
C  3.735314 0.922501 0.86899
C  6.266314 0.556424 0.78615
H  -2.22078 0.593443 1.421456
H  -2.319029 1.576626 -0.059726
H  -5.870482 1.045733 0.126906
H  -4.650547 2.137207 0.830238
H  -3.579371 -1.455425 1.383558
H  -4.698454 -0.278324 2.112653
H  -1.762783 -0.353315 -1.485692
H  -1.815094 -1.470655 -0.075628
H  -3.671543 2.468782 -1.528808
H  -4.93106 1.374342 -2.167443
H  -5.387649 2.946851 -1.426822
H  -6.488955 -1.001348 0.412502
H  -5.319815 -2.158672 -0.281806
H  -5.90596 -2.364394 1.404539
H  0.630089 -0.870027 -1.821088
H  0.568519 -2.007387 -0.434948
H  3.103604 -2.141256 -1.471951
H  1.559154 1.137195 0.901468
H  5.432952 -1.502477 -0.858305
H  3.906423 1.786899 1.523155
H  6.366323 1.641297 0.967745
H  6.565461 0.038918 1.718747
H  6.994712 0.272374 0.005905
