program: Gaussian 09
title: 000213071
version: EM64L-G09RevD.01
frameworkgroup: C1[X(C19H22N2O4)]
method: RPBEPBE
basis: SDD
operation: Freq
keyword: #p
keyword: freq=noraman
keyword: PBEPBE/SDD
title: #p freq=noraman PBEPBE/SDD
converged: YES YES NO NO
title: Mulliken charges:
elementType: O O O O N N C C C C C C C C C C C C C C C C C C C H H H H H H H H H H H H H H H H H H H H H H
charge: -0.323999 -0.309464 -0.271346 -0.285608 -0.462843 -0.616475 0.177435 -0.392845 -0.310778 -0.429331 0.483841 -0.731640 -0.414956 -0.379986 -0.245618 -0.264474 -0.244381 0.263754 0.292825 0.484278 -0.445723 -0.356591 -0.195639 -0.211393 -0.257809 0.216006 0.194948 0.214319 0.261224 0.259810 0.242731 0.229922 0.212174 0.257468 0.241597 0.219192 0.225121 0.225064 0.229566 0.331752 0.343737 0.341862 0.223275 0.298310 0.226354 0.225716 0.228620
chargesum: 0.00000
title: Mulliken charges with hydrogens summed into heavy atoms:
elementType: O O O O N N C C C C C C C C C C C C C C C C C C C
charge: -0.323999 -0.309464 -0.271346 -0.285608 -0.131091 0.069125 0.177435 0.018109 0.164765 0.073209 0.483841 -0.032076 -0.173360 -0.160794 -0.020497 -0.039411 -0.014815 0.263754 0.292825 0.484278 -0.222449 -0.058281 0.030715 0.014323 -0.029189
polarizability: 2.72561877e+02 -1.51627175e+01 2.40241078e+02 -7.76215883e+00 -2.85566971e+01 1.84978878e+02
1716.lowfreq: -10.4552 -0.0006 -0.0004 0.0002 2.6115 5.9371 11.9342 23.2405 26.8469
frequency: 11.2551 22.7536 26.8210 33.4285 39.4991 52.1487 61.3529 69.6121 80.1022 98.2622 111.7058 120.8795 165.8007 173.2292 194.2084 220.5532 245.5379 252.0999 257.6809 273.7310 295.3289 303.2218 339.8651 350.3992 389.6528 400.8260 409.0759 444.2633 466.4642 480.4251 504.3763 510.1819 530.1472 572.4420 585.8914 604.2849 615.9436 616.9368 621.4915 647.1021 688.7971 696.2583 698.6115 701.2195 702.6874 733.7410 766.0570 766.5849 794.9060 801.2610 825.8670 842.5208 847.5939 855.0213 896.8015 911.0019 913.8536 925.5601 971.9706 972.0790 984.0615 988.1448 990.3331 993.3753 996.1797 1005.1489 1012.2793 1028.0555 1032.7283 1040.4789 1056.1111 1062.2232 1086.4715 1090.1661 1103.4824 1133.8593 1154.4112 1172.4814 1174.0349 1189.0807 1190.5895 1202.2395 1208.7039 1239.9679 1260.0104 1267.6035 1292.3165 1312.1372 1324.5341 1327.1009 1333.2419 1353.8247 1370.3948 1378.4764 1387.1204 1401.1971 1434.0311 1435.0364 1466.6810 1468.9508 1479.3559 1484.8348 1486.1723 1487.7076 1500.0698 1517.9278 1588.0980 1590.7238 1601.5013 1614.0574 1617.9896 1666.0041 1687.8554 2981.4225 2986.8131 3014.6257 3027.2890 3030.7783 3077.6991 3088.9319 3091.3815 3099.0908 3113.9265 3116.6085 3125.9840 3131.8932 3139.2748 3144.0925 3152.5711 3165.0605 3165.2511 3188.3702 3538.3774 3555.6652 3714.5417
redmass: 6.1583 4.5415 4.5280 5.6125 5.2440 5.7688 4.8891 5.9281 5.2569 4.0070 3.3028 3.6293 6.8865 3.3122 4.5915 1.7005 5.7695 4.4912 3.5877 5.1073 2.0308 2.5225 6.5462 2.2680 4.2773 2.7917 2.9277 4.3892 3.1224 3.0691 1.1555 2.8243 1.0833 2.8733 3.8245 5.2790 6.4039 6.3449 5.8585 1.3394 5.6961 2.2167 9.0288 3.9202 1.7018 3.7089 1.7430 1.6702 1.9384 2.5083 5.4392 1.2650 1.2660 2.3205 3.7627 1.8413 1.4331 2.1268 1.3555 1.3992 5.8817 1.8768 5.8251 1.3328 1.3032 5.7777 4.6057 2.4157 2.3765 1.7741 2.4692 2.3140 1.6771 1.5506 2.0161 2.6326 3.1747 1.0500 1.0547 1.1902 1.6633 1.2463 2.7379 1.2757 2.0751 1.1410 1.6356 1.9160 1.4051 1.4166 1.4660 1.3380 1.6085 5.0978 6.8642 1.2045 2.3318 2.2655 1.1014 1.0806 1.0754 1.0972 2.1561 2.0367 1.0540 2.2117 1.3342 4.0557 5.2838 6.0153 6.0380 8.6097 7.2168 1.0570 1.0384 1.0596 1.0613 1.0955 1.0988 1.1018 1.1036 1.1079 1.0882 1.0859 1.0865 1.0869 1.0926 1.0935 1.0947 1.0996 1.1007 1.0953 1.0761 1.0447 1.1057
irintensity: 0.3596 0.9494 0.5922 1.1302 1.0907 2.1612 7.0880 0.2564 1.9629 2.3778 1.2748 0.9007 0.3101 2.8744 1.0268 0.6428 14.6497 2.6423 9.0693 1.4095 2.9335 9.2708 3.2270 13.1572 2.3164 0.0212 0.0040 6.8092 1.3438 12.4073 221.2644 30.3545 67.8787 9.7051 10.2675 0.2828 4.9756 0.2736 4.3268 21.8374 16.6009 15.1149 12.5878 72.7387 67.3886 24.0241 31.2452 105.8816 10.0678 38.2978 5.5205 0.3824 0.5420 3.0974 20.5656 3.5510 13.4967 7.5391 0.0356 0.3711 17.6847 69.4676 3.0988 0.3370 2.1373 285.3708 186.7511 8.6418 18.7303 17.7973 65.8865 20.6262 6.7710 39.4854 2.3419 6.3939 491.4077 0.3737 0.1366 0.7590 32.5021 3.6101 2.7294 2.5716 4.0611 5.8697 223.0775 172.6804 44.6136 17.0277 10.5826 23.0347 68.9872 5.4117 48.7226 20.1672 123.5426 6.4929 24.3691 6.7789 26.4410 26.7367 25.5152 8.6948 12.0582 542.3524 110.9869 13.6222 30.0458 6.5609 109.0535 195.7818 349.8342 31.2677 27.1302 34.0881 13.4320 38.2894 36.6980 11.2416 28.3519 6.2600 13.7897 8.7648 0.0174 0.8320 25.9656 30.9181 40.2770 24.7101 15.0720 6.4856 24.8877 68.2346 57.1822
temp: 298.150 k
press: 1.00000 atm
elementType: 8 8 8 8 7 7 6 6 6 6 6 6 6 6 6 6 6 6 6 6 6 6 6 6 6 1 1 1 1 1 1 1 1 1 1 1 1 1 1 1 1 1 1 1 1 1 1
symmnumber: 1
zpe: 995476.0 jmol-1
zpe.correction: 0.379157 hartree
zpe.thermalcorrener: 0.403394 hartree
zpe.thermalcorrenthalpy: 0.404339 hartree
zpe.thermalcorrgfe: 0.321301 hartree
zpe.sumelectzpe: -1145.819045 hartree
zpe.sumelectthermal: -1145.794807 hartree
zpe.sumelectthermalent: -1145.793863 hartree
zpe.sumelectthermalfe: -1145.876901 hartree
dipole: -0.7306 -0.6007 0.1331
dipole: 0.9551
quadrupole: -152.0760 -125.4736 -145.4589
quadrupole: -3.2394 -12.2664 -7.4740
quadrupole: -11.0732 15.5292 -4.4561 -3.2394 -12.2664 -7.4740
hfenergy: -1146.1982019 hartree
pointgroup: C01 [X(C19H22N2O4)]
dipole: -0.2928252 -0.2177949 0.0895554 debye
polarizability: 271.4579582|-17.6804745|231.734212|-7.2923346|-34.9811825|194.5896635 unknown
InChI: InChI=1S/C19H22N2O4/c1-2-19(13-24-17(20)22,15-9-5-3-6-10-15)14-25-18(23)21-16-11-7-4-8-12-16/h3-12,21H,2,13-14,20H2,1H3
charge 0 multiplicity 1
47 atoms
O  -0.323421 -0.380162 -0.483267
O  1.626704 2.355659 -0.010982
O  -1.798786 0.910891 -1.802316
O  3.594783 3.333674 0.869318
N  -2.503607 -0.361761 0.074727
N  2.010267 4.562946 -0.35205
C  2.114317 -0.01416 -0.546285
C  3.264203 0.384278 -1.538398
C  0.803559 -0.015613 -1.374519
C  1.97968 1.042892 0.579488
C  2.382685 -1.416619 0.048745
C  4.678442 0.426661 -0.920632
C  2.580289 -1.641654 1.435367
C  2.465514 -2.538572 -0.819569
C  2.845265 -2.937571 1.93629
C  2.728919 -3.833216 -0.32598
C  2.920475 -4.04119 1.059849
C  -1.586667 0.139555 -0.834321
C  2.517332 3.423044 0.229045
C  -3.902492 -0.113622 0.132949
C  -4.636388 -0.759753 1.164115
C  -4.574056 0.737681 -0.784273
C  -6.026502 -0.557856 1.278501
C  -5.966679 0.92856 -0.654452
C  -6.702679 0.288871 0.369216
H  3.019969 1.374607 -1.970563
H  3.257964 -0.334353 -2.381723
H  0.84382 -0.759945 -2.189851
H  0.610165 0.982024 -1.803327
H  2.914205 1.159941 1.153659
H  1.14466 0.78697 1.252067
H  4.942999 -0.539445 -0.454799
H  5.426304 0.638858 -1.706351
H  4.767265 1.220519 -0.158414
H  2.53534 -0.812011 2.147333
H  2.324602 -2.406211 -1.899085
H  2.99539 -3.080853 3.012546
H  2.786242 -4.678394 -1.02128
H  3.126805 -5.045113 1.447078
H  -2.107505 -0.993403 0.774691
H  1.113657 4.540066 -0.832439
H  2.534801 5.428687 -0.267713
H  -4.118719 -1.41892 1.872822
H  -4.007158 1.230206 -1.576905
H  -6.58018 -1.062593 2.077924
H  -6.479692 1.586128 -1.365369
H  -7.782793 0.445775 0.457729
