program: Gaussian 09
title: 000213020
version: EM64L-G09RevD.01
frameworkgroup: C1[X(C7H7ClN2O3S)]
method: RPBEPBE
basis: SDD
operation: Freq
keyword: #p
keyword: freq=noraman
keyword: PBEPBE/SDD
title: #p freq=noraman PBEPBE/SDD
converged: YES YES NO NO
title: Mulliken charges:
elementType: Cl S O O O N N C C C C C C C H H H H H H H
charge: 0.005975 0.944355 -0.531571 -0.508738 -0.253567 -0.713923 -0.631005 0.046074 -0.379856 0.341684 -0.116979 -0.351649 -0.202049 0.157545 0.339588 0.235554 0.267418 0.335371 0.348599 0.321906 0.345269
chargesum: 0.00000
title: Mulliken charges with hydrogens summed into heavy atoms:
elementType: Cl S O O O N N C C C C C C C
charge: 0.005975 0.944355 -0.531571 -0.508738 -0.253567 -0.029953 0.036170 0.046074 -0.040268 0.341684 -0.116979 -0.116095 0.065369 0.157545
polarizability: 1.87257861e+02 5.68005353e+00 1.42323611e+02 2.76963617e+00 -4.40562685e+00 7.54743621e+01
1716.lowfreq: -3.6070 -0.0019 -0.0016 0.0012 1.8541 4.9426 42.2901 51.2365 83.8549
frequency: 42.2787 51.2271 83.8531 105.0627 113.9696 134.0042 158.8320 206.4825 220.2644 233.7524 262.3325 286.1030 292.8246 325.7380 366.6836 430.4875 439.8784 449.8062 474.1559 495.1948 499.6738 541.4782 613.3253 624.1556 646.6819 708.5235 746.6615 768.2623 799.7597 814.2596 834.8931 918.5696 960.1041 975.1264 993.9825 1050.5396 1071.8087 1097.1998 1117.7685 1157.0779 1238.7619 1339.8298 1363.0411 1394.5534 1455.5356 1526.1180 1557.1147 1587.8151 1596.0169 1638.9600 3140.7199 3143.5297 3172.4558 3379.2182 3526.0626 3550.7803 3677.5200
redmass: 5.8051 6.9515 6.7069 5.1834 8.0331 1.8453 5.6228 5.6076 4.9881 7.3991 4.2658 4.1661 10.3275 7.0562 6.3918 8.9277 3.1530 2.8773 1.9580 3.8590 2.4559 2.5927 1.5771 4.3184 6.8899 4.5584 3.4700 2.2347 3.5269 13.4862 1.4833 4.1580 1.4548 1.3877 4.6376 1.8852 1.5711 2.0479 3.6796 1.3529 1.3898 3.1190 4.7112 5.4783 2.9113 1.0903 7.1265 2.1040 6.4436 2.1867 1.0895 1.0916 1.0960 1.0411 1.0451 1.1013 1.1039
irintensity: 12.9774 3.8669 0.6901 3.8667 1.1217 18.0517 8.8697 2.2303 9.8856 13.1313 0.7445 1.6565 1.2924 1.2499 9.6160 92.3764 61.8626 25.9125 173.8297 6.9200 34.7845 54.7584 101.9541 5.2979 3.7658 15.6853 40.2758 94.2941 58.6639 79.7729 28.0643 68.3951 3.1734 12.1066 33.7442 0.8773 7.2234 41.1121 0.3792 3.5795 48.7391 196.9013 81.1491 27.2486 26.1349 38.4401 26.5032 67.5427 52.4070 243.3788 8.1831 20.1440 2.9046 34.7491 51.9786 28.7618 32.5450
temp: 298.150 k
press: 1.00000 atm
elementType: 17 16 8 8 8 7 7 6 6 6 6 6 6 6 1 1 1 1 1 1 1
symmnumber: 1
zpe: 361277.1 jmol-1
zpe.correction: 0.137603 hartree
zpe.thermalcorrener: 0.152297 hartree
zpe.thermalcorrenthalpy: 0.153241 hartree
zpe.thermalcorrgfe: 0.095234 hartree
zpe.sumelectzpe: -1463.039286 hartree
zpe.sumelectthermal: -1463.024592 hartree
zpe.sumelectthermalent: -1463.023648 hartree
zpe.sumelectthermalfe: -1463.081655 hartree
dipole: -2.8597 5.9204 1.4294
dipole: 6.7285
quadrupole: -74.9973 -100.6915 -100.8456
quadrupole: -14.9790 16.8499 -3.4853
quadrupole: 17.1808 -8.5134 -8.6675 -14.9790 16.8499 -3.4853
hfenergy: -1463.1768893 hartree
pointgroup: C01 [X(C7H7Cl1N2O3S1)]
dipole: 1.1537606 -2.2603341 0.7532007 debye
dipolederiv: -0.5533029 -0.3096255 0.0584599 -0.2461376 -0.2508073 0.0330431 0.0656805 0.0415659 -0.0141243 1.771847 -0.4356451 -0.1549563 -0.42201 1.4598996 0.042681 -0.0993093 0.0205123 1.5291322 -0.6058895 0.0798811 0.0592602 0.062873 -0.6857609 0.0724907 -0.0145407 -0.0509994 -0.4795233 -0.685737 0.1003534 -0.118882 0.0955577 -0.522731 -0.1207157 -0.0681706 0.0116899 -0.6274641 -0.7608945 -0.1765605 0.0361528 -0.0690482 -0.9160434 -0.1354636 0.0861829 -0.0775081 -0.386975 -0.6869342 0.1438891 0.1410594 0.1504918 -0.4273198 0.0525447 0.1958508 -0.0058376 -0.8246565 -1.1370532 0.3801376 0.1437416 0.3262558 -0.4887625 0.0310892 0.1335317 0.0485819 -0.681527 -0.0947828 -0.2179834 0.0024874 -0.0402681 -0.3064086 0.0227555 -0.0653219 0.0598692 -0.1592319 -0.0997283 0.0092286 -0.0012882 0.1070358 -0.163686 0.0081105 -0.0335204 0.0284091 -0.0512039 -0.3643886 -0.013761 0.0135602 -0.2765967 -0.1156688 -0.0055259 0.0208479 -0.0197509 0.0170609 0.6869099 0.6976453 -0.1050586 0.1657535 0.4102078 -0.0764863 -0.0479441 -0.0717497 -0.0216532 0.0976311 -0.0262818 0.0223916 0.1284742 0.0798857 -0.0442657 0.0501845 -0.0226055 -0.1256465 -0.3988593 -0.1723686 0.0222777 0.0557016 -0.0185866 -0.013118 0.0116636 -0.009674 -0.0733202 1.7732724 -0.0349647 -0.2546752 -0.0041567 1.1279663 0.2472859 -0.300845 0.1647433 0.3276523 0.2160581 -0.0169248 -0.003777 0.0076351 0.1398699 0.0097664 0.0087033 0.0003858 0.1514693 -0.0564091 0.0885121 -0.0135352 0.0780034 0.057709 0.0179313 -0.0283873 0.0056409 0.1448304 0.0621781 -0.005545 -0.000346 -0.0065293 -0.0267043 0.0297221 -0.0021491 0.0328507 0.1584466 0.1667591 -0.0574465 0.0045165 -0.0481825 0.2164156 -0.0989073 0.0210657 -0.0656371 0.1469127 0.1672819 0.0237221 0.1163744 -0.0243267 0.123827 0.0434646 0.0457334 0.0303262 0.2560269 0.2766147 -0.0372664 0.0071699 -0.041722 0.1309415 -0.0655953 -0.0062608 -0.0748985 0.3492559 0.2254271 -0.0189959 0.0250666 0.0011958 0.1757568 -0.0508071 0.0270047 -0.0459143 0.3645387 unknown
polarizability: 187.0323468|5.6673827|142.6402643|-5.2532009|-1.8944934|75.3832228 unknown
InChI: InChI=1S/C7H7ClN2O3S/c8-5-2-1-4(7(9)11)3-6(5)14(10,12)13/h1-3H,9-10H2
charge 0 multiplicity 1
21 atoms
Cl -2.433404 -2.201257 0.361703
S  -2.195372 1.154006 -0.190897
O  -1.592188 2.662615 -0.255749
O  -3.162183 0.574687 -1.357458
O  3.132839 1.813884 0.242846
N  -3.01887 1.02081 1.436993
N  4.163464 -0.190534 -0.305297
C  -0.696811 0.000809 0.039005
C  0.553974 0.626202 -0.023547
C  1.728219 -0.15852 0.08392
C  -0.822551 -1.385708 0.233758
C  1.607926 -1.556691 0.28341
C  0.340598 -2.171315 0.364748
C  3.0506 0.570078 0.017593
H  0.62952 1.71305 -0.148935
H  2.496827 -2.182036 0.420537
H  0.24813 -3.24725 0.537814
H  -3.860321 0.429528 1.353299
H  -3.200587 1.976732 1.783666
H  4.10564 -1.156223 -0.62103
H  5.06435 0.285737 -0.343778
