program: Gaussian 09
title: 000213021
version: EM64L-G09RevD.01
frameworkgroup: C1[X(C10H11ClN4)]
method: RPBEPBE
basis: SDD
operation: Freq
keyword: #p
keyword: freq=noraman
keyword: PBEPBE/SDD
title: #p freq=noraman PBEPBE/SDD
converged: YES YES NO NO
title: Mulliken charges:
elementType: Cl N N N N C C C C C C C C C C H H H H H H H H H H H
charge: -0.021981 -0.093836 0.072213 -0.099826 -0.083796 -0.547258 0.511230 0.273766 -0.641966 -0.285010 -0.532346 -0.770519 -0.135788 -0.256636 -0.253026 0.287944 0.218283 0.256386 0.243866 0.259052 0.289696 0.257606 0.252168 0.250926 0.284021 0.264833
chargesum: 0.00000
title: Mulliken charges with hydrogens summed into heavy atoms:
elementType: Cl N N N N C C C C C C C C C C
charge: -0.021981 -0.093836 0.072213 -0.099826 -0.083796 -0.041031 0.511230 0.273766 0.117338 0.004685 -0.274740 0.016596 0.129045 -0.256636 -0.253026
polarizability: 2.01007931e+02 -2.18875551e+01 1.58985051e+02 -8.59590634e+00 -6.65259125e+00 8.77514836e+01
1716.lowfreq: -4.0985 0.0003 0.0012 0.0022 5.9626 7.9694 22.4182 38.2710 51.3173
frequency: 22.2213 38.1383 51.3100 80.3918 96.5568 113.9522 129.5533 141.4734 186.5491 200.6182 268.6867 294.8120 313.0377 348.5778 398.5100 401.7258 415.3963 460.1601 493.9339 517.2051 524.7685 548.6852 594.4408 615.5473 666.0252 735.7612 760.1008 806.3321 853.4431 890.4410 927.5775 952.9015 993.1119 999.1446 1024.7350 1036.5811 1076.7562 1085.2407 1117.4086 1134.1962 1152.2737 1205.2358 1218.9363 1279.7964 1282.3441 1330.8311 1357.0756 1374.7243 1396.7396 1426.9700 1445.1778 1449.7599 1460.2641 1461.8979 1478.5864 1490.1766 1500.8883 1548.6376 1578.3760 1601.2977 2140.3555 2973.4242 2991.7854 3004.3919 3054.6261 3078.7095 3080.2870 3109.6679 3121.6852 3130.2075 3154.8314 3186.1990
redmass: 6.1715 6.1195 4.9372 1.1547 2.6647 5.6439 4.5836 7.6924 3.3741 1.4289 4.9135 4.6526 5.6240 2.9795 5.8558 2.2191 3.4316 4.2404 3.7658 11.5946 4.5211 3.5027 5.0578 7.9928 5.3583 5.3859 4.2129 4.3308 1.5878 2.5600 1.5283 1.8651 1.9440 1.8504 1.7797 1.5822 3.2743 4.2064 1.3135 1.5887 1.6504 2.3434 2.5406 2.2614 1.6293 5.7228 1.3842 1.8137 1.2067 1.5831 2.1016 1.1827 1.1149 1.0959 1.3048 1.0851 1.4502 6.5440 5.8431 5.4393 12.6025 1.0410 1.0379 1.0629 1.0978 1.1003 1.0973 1.1004 1.0921 1.0960 1.0919 1.0969
irintensity: 4.8004 7.9346 1.2878 0.4107 0.7384 2.4460 1.2553 0.1371 2.0838 0.2705 4.1691 3.4373 2.1281 5.3629 21.7562 2.7699 5.1169 2.5920 2.3922 1.8215 4.9170 7.8808 7.9936 4.0383 6.4775 5.0813 5.2784 29.0576 34.0426 17.6734 2.5524 9.5344 15.5918 17.7332 29.4511 3.3546 5.8758 135.2359 2.0202 3.6079 26.0969 8.8556 4.3983 84.9442 4.0079 27.8141 23.4258 22.1939 33.0866 41.0363 132.1963 40.2681 40.0457 41.6376 11.5200 2.5230 33.5801 19.4210 51.0222 547.4721 311.7721 56.9022 7.1441 39.5899 19.6757 7.2819 7.7440 3.7329 20.0889 10.2138 0.1423 1.0980
temp: 298.150 k
press: 1.00000 atm
elementType: 17 7 7 7 7 6 6 6 6 6 6 6 6 6 6 1 1 1 1 1 1 1 1 1 1 1
symmnumber: 1
zpe: 516680.1 jmol-1
zpe.correction: 0.196793 hartree
zpe.thermalcorrener: 0.211903 hartree
zpe.thermalcorrenthalpy: 0.212847 hartree
zpe.thermalcorrgfe: 0.152208 hartree
zpe.sumelectzpe: -1065.608373 hartree
zpe.sumelectthermal: -1065.593264 hartree
zpe.sumelectthermalent: -1065.592320 hartree
zpe.sumelectthermalfe: -1065.652958 hartree
dipole: 0.9388 6.2295 1.6682
dipole: 6.5170
quadrupole: -129.7624 -98.4042 -91.8464
quadrupole: 29.0052 7.0516 -1.9189
quadrupole: -23.0914 8.2668 14.8246 29.0052 7.0516 -1.9189
hfenergy: -1065.8051663 hartree
pointgroup: C01 [X(C10H11Cl1N4)]
dipole: 0.1274397 2.4260213 0.8198421 debye
dipolederiv: -0.8225428 -0.3329098 0.2268837 -0.3299252 -0.2637116 0.1118709 0.2585575 0.1299752 -0.1678581 -1.2168608 0.5572978 0.1337361 0.3183988 -0.8601769 -0.0968522 -0.2014176 0.0122532 -0.3522097 -0.5387216 0.0124053 0.0417987 -0.4413873 -0.6244808 0.22856 0.2375501 0.1584032 -0.2512771 -1.0451733 0.5631528 0.0197796 0.9728737 -1.1692286 -0.2640583 0.2430102 -0.4029803 -0.3776549 -0.605278 0.216832 0.037887 0.3471384 -0.5278639 -0.0356543 0.0441592 -0.0241465 -0.2946467 0.4882514 0.0738072 0.0718984 0.3270224 0.1947301 -0.0941522 0.3289478 -0.1486986 0.266111 0.1251613 0.1303991 -0.0681025 0.0232489 -0.1985846 0.0834783 -0.0842212 0.0926798 -0.0915175 1.2438378 -0.7296894 0.0241367 -1.0489037 1.2987604 0.3889061 -0.0067256 0.3862956 0.4793398 0.0656407 -0.0318667 -0.0817002 -0.0306237 0.5256682 0.0739854 -0.1749165 0.1693731 0.1833979 0.067949 -0.0204491 -0.0231662 0.0550597 0.1107756 -0.093069 -0.0358609 -0.0601482 -0.0591733 0.1765114 -0.1265671 -0.0071256 0.0649471 0.3147022 -0.1667348 -0.0872651 -0.1346251 -0.0218479 -0.1324855 0.0214866 -0.1314851 0.025354 -0.0316301 -0.1120507 -0.2195684 -0.1037126 -0.1397747 -0.5232535 -0.1732057 0.1240138 -0.0217733 0.010777 -0.0120937 0.0990163 0.0087654 -0.0896982 1.3229952 0.4837089 -0.3930624 0.5973548 0.5801727 -0.2958848 -0.4683443 -0.2979037 0.1851567 0.8766454 -0.6717713 -0.0642619 -0.8506593 0.6593221 0.0595916 -0.0561299 0.0137757 0.0177748 0.0690671 -0.0356836 0.0691234 -0.0881687 0.0633638 -0.0812072 -0.0042027 -0.0311721 0.0618607 -0.0160534 0.0610205 -0.067137 -0.0068567 -0.1048117 0.1197376 -0.0639771 0.0591941 0.063771 -0.1068097 0.0723648 0.0759428 0.0354917 0.0536427 -0.008377 0.0741408 -0.007255 0.0961839 0.0764207 -0.045323 0.0346446 0.0143102 -0.1826647 0.0176727 0.0600654 0.0936898 0.0197521 0.0696912 -0.0275672 -0.1110517 0.0027803 0.0696978 0.0176594 -0.0816629 -0.0362243 -0.047754 0.0735655 0.0675839 0.0107239 0.079721 0.0834166 0.0177109 0.0036541 0.0084076 0.1244842 0.0922163 -0.0367323 0.0256473 -0.0508754 -0.0716128 0.0768782 0.0340396 0.0712939 0.0976496 0.042068 -0.0322266 0.0887415 -0.0202247 0.1053518 0.0035366 0.0501054 -0.0182037 -0.0438014 0.1076464 -0.0387248 -0.0359527 -0.0667834 -0.0885491 0.0029558 0.0006912 0.0278063 0.0807774 0.0192649 0.0437432 -0.0151248 0.1048457 0.0634211 0.000839 0.0330359 -0.0239083 0.1202152 0.0902463 -0.0010854 0.0132124 -0.0123656 -0.0104872 0.0567519 0.0173187 0.0570659 0.1407391 unknown
polarizability: 204.3391232|-16.1587389|155.3338797|-14.205064|-2.2056168|88.0714624 unknown
InChI: InChI=1S/C10H11ClN4/c1-8(14-7-12)15(2)6-9-3-4-10(11)13-5-9/h3-5H,6H2,1-2H3
charge 0 multiplicity 1
26 atoms
Cl -4.989489 -1.407261 0.728976
N  1.203131 1.383116 -0.013818
N  -3.442763 0.587317 -0.26357
N  2.394616 -0.51835 -0.601239
N  4.256229 -2.243297 -0.607459
C  0.254001 1.114744 -1.129839
C  -1.03165 0.447268 -0.666145
C  2.287534 0.558381 0.183025
C  0.904985 2.559653 0.818334
C  -1.040475 -0.900358 -0.21031
C  -2.263483 1.141333 -0.678198
C  3.28974 0.908652 1.26955
C  -2.248637 -1.485689 0.215689
C  -3.409896 -0.678936 0.166799
C  3.408609 -1.386422 -0.552322
H  0.783708 0.469546 -1.849959
H  0.024906 2.082518 -1.615271
H  -0.177084 2.584362 1.039793
H  1.177556 3.498853 0.298046
H  1.442366 2.519563 1.776076
H  -0.108636 -1.475416 -0.203371
H  -2.326876 2.176151 -1.037035
H  2.851931 0.774192 2.276092
H  3.638552 1.952348 1.184551
H  4.162169 0.241151 1.191117
H  -2.297346 -2.519418 0.565286
