program: Gaussian 09
title: 000213015
version: EM64L-G09RevD.01
frameworkgroup: C1[X(C10H5Cl3N4S3)]
method: RPBEPBE
basis: SDD
operation: Freq
keyword: #p
keyword: freq=noraman
keyword: PBEPBE/SDD
title: #p freq=noraman PBEPBE/SDD
converged: NO YES NO NO
title: Mulliken charges:
elementType: Cl Cl Cl S S S N N N N C C C C C C C C C C H H H H H
charge: 0.013904 0.014767 0.006747 0.366784 0.505617 0.280093 -0.410868 -0.024940 0.051378 -0.354145 0.469109 0.221725 -0.113706 -0.294423 -0.317766 -0.102705 -0.252897 -0.479954 -0.174561 -0.836428 0.341719 0.282936 0.278714 0.278919 0.249977
chargesum: 0.00000
title: Mulliken charges with hydrogens summed into heavy atoms:
elementType: Cl Cl Cl S S S N N N N C C C C C C C C C C
charge: 0.013904 0.014767 0.006747 0.366784 0.505617 0.280093 -0.069149 -0.024940 0.051378 -0.354145 0.469109 0.221725 -0.113706 -0.294423 -0.317766 -0.102705 0.030039 -0.479954 -0.174561 -0.028817
polarizability: 4.08772032e+02 -1.89723198e-02 2.31922730e+02 -4.70615628e-02 -8.22018643e-02 7.88530105e+01
1716.lowfreq: -1.2492 -0.0011 0.0007 0.0010 4.7393 5.2287 13.6467 27.8380 41.6395
frequency: 13.5933 27.7895 41.6378 47.7535 62.3387 97.5500 108.2038 120.7229 131.1347 161.0053 170.3258 172.0939 180.4299 186.5989 238.3622 241.6846 282.3478 300.5112 307.9916 319.0840 354.6892 369.0240 402.1509 438.1007 480.2901 496.3996 506.8990 550.1112 563.0768 593.8703 601.0400 610.5673 623.3779 653.3338 658.5760 661.1668 669.0609 756.0924 768.3674 838.7607 846.4858 924.9101 928.9982 938.8404 964.4996 978.2735 995.5611 1145.4063 1151.0674 1166.0613 1219.5585 1245.9896 1321.4098 1323.3455 1352.1534 1361.1409 1406.4702 1412.4709 1438.6275 1447.5174 1454.2320 1462.0108 1568.1141 1628.9432 3025.3283 3147.0295 3159.0991 3184.1077 3582.3161
redmass: 18.6185 4.6446 15.1299 7.0647 27.2439 14.4176 5.5374 23.1678 1.2555 4.5561 15.6147 8.7241 26.0565 7.6992 5.6584 13.1427 13.8527 6.4202 13.9016 19.9449 19.3333 11.8310 18.9989 12.8742 15.6269 12.5500 9.9825 4.0977 6.8387 7.1385 12.3246 1.3190 14.7739 9.4563 9.1690 8.0220 9.1533 11.4581 8.6830 13.3739 1.4387 10.8917 11.6002 10.0022 7.4626 1.1734 1.2710 2.3748 9.9957 2.1227 5.9495 3.5535 9.2719 6.9443 1.1707 3.3941 8.0238 9.8599 1.0528 6.2481 1.0741 4.1351 9.6274 9.9473 1.0284 1.1036 1.1062 1.0927 1.0819
irintensity: 0.0837 1.3941 0.4574 0.9290 0.0028 0.0169 1.3791 3.3158 0.6170 0.2091 0.6511 0.2570 0.8080 6.5035 2.5976 5.2704 0.1049 3.0600 4.5752 3.5043 5.0892 1.6348 3.3098 0.6108 13.3629 1.9681 11.7015 0.5473 33.0165 3.3659 0.5222 123.0381 3.6275 1.8452 0.0041 1.7119 2.4436 37.0716 0.4365 43.3819 20.9200 15.4256 65.6738 25.4821 57.8441 7.7122 16.4728 57.9097 146.9466 6.6972 92.7830 11.6272 50.6690 223.3140 10.5367 97.2656 161.9373 357.8381 15.1761 82.1697 7.9967 56.3010 7.5611 26.9324 22.4372 9.6511 11.5725 2.1052 83.3561
temp: 298.150 k
press: 1.00000 atm
elementType: 17 17 17 16 16 16 7 7 7 7 6 6 6 6 6 6 6 6 6 6 1 1 1 1 1
symmnumber: 1
zpe: 362385.2 jmol-1
zpe.correction: 0.138025 hartree
zpe.thermalcorrener: 0.157897 hartree
zpe.thermalcorrenthalpy: 0.158842 hartree
zpe.thermalcorrgfe: 0.085801 hartree
zpe.sumelectzpe: -3175.980242 hartree
zpe.sumelectthermal: -3175.960370 hartree
zpe.sumelectthermalent: -3175.959425 hartree
zpe.sumelectthermalfe: -3176.032466 hartree
dipole: 2.0327 -4.9742 0.0247
dipole: 5.3735
quadrupole: -164.2919 -152.1582 -159.5997
quadrupole: 17.4115 -0.1374 -0.0244
quadrupole: -5.6086 6.5250 -0.9164 17.4115 -0.1374 -0.0244
hfenergy: -3176.1182671 hartree
pointgroup: C01 [X(C10H5Cl3N4S3)]
dipole: -0.7922993 1.2404848 -1.5175469 debye
dipolederiv: -0.2406068 0.1493378 -0.1158055 0.262192 -0.2430234 0.2550709 -0.2905323 0.3086585 -0.3369088 -0.1572563 0.1649877 -0.1860054 0.1132828 -0.2442236 0.3028706 -0.1059965 0.2782682 -0.3917337 -0.822789 0.1604559 0.1329306 0.1733884 -0.0651187 -0.0109833 0.1130023 -0.0048317 -0.0650949 -0.7555703 0.2225567 0.0657737 0.3763672 -0.0334548 0.0451689 -0.1702299 0.1172956 0.0107949 0.5964746 -0.1853184 0.1196008 -0.1686821 0.2117026 0.1373826 0.0921027 0.1459022 -0.0185136 -0.5023228 -0.0450217 0.2793803 0.0063824 0.0090095 -0.0875541 0.2013008 -0.0638829 -0.0450899 -0.9022043 0.1538177 0.0754329 0.0843347 -0.333471 0.1035085 0.1828933 0.0706263 -0.4367725 -0.9698523 0.0841483 0.2477246 -0.0735517 -0.2596983 0.1706186 0.4922218 0.0955207 -0.5518892 -1.5725166 0.2323884 0.3324128 0.4165736 -0.2754214 0.0710813 0.0516442 0.1574161 -0.3676333 -0.8134521 0.1492885 0.0197415 -0.1325748 -0.2909178 0.0756549 0.4544609 -0.0571629 -0.4062247 -0.0558707 0.1472879 -0.1410342 0.3863102 0.0012188 0.0083046 -0.5081506 0.1212398 0.1777795 0.5016513 0.0877312 -0.3484507 -0.0876507 -0.051379 0.2000378 -0.0789512 0.1169861 -0.0913926 1.3150585 -0.3124512 -0.1296529 -0.1109061 0.2242421 -0.2550481 -0.4396733 -0.1596579 0.4789995 0.2017795 -0.2877558 0.3009404 -0.3254157 0.2717153 -0.4234132 0.3592231 -0.4413345 0.4104791 0.3957604 -0.3250604 0.2770268 -0.1428256 0.3272632 -0.5557189 -0.0040995 -0.4692688 0.6478722 1.072521 -0.1641067 -0.2727824 -0.3509796 0.0465458 0.0356191 0.01568 -0.0527904 0.0355712 -0.5598961 0.1579361 -0.0114959 0.2082315 -0.1731683 0.0611455 -0.0894384 0.0849168 -0.1578567 1.1483891 -0.2773226 -0.1601182 -0.5108479 0.2140437 -0.2459356 0.1985899 -0.3559196 0.3505625 1.7175672 -0.2383305 -0.4228272 -0.1892736 0.0756352 0.0163923 -0.4995265 0.0401792 0.2037674 -0.0247922 0.0792905 -0.0820839 0.1002749 0.055169 -0.0469673 -0.1151398 -0.0373711 0.164092 0.2288447 0.0208164 0.0285056 0.0192562 0.3263878 0.0370206 0.0307497 0.0360452 0.2865678 0.0736234 0.0097268 0.0313239 0.0114049 0.1337569 0.0526379 0.0289206 0.0533343 0.0752913 0.1559766 0.046895 -0.0117675 -0.0011921 -0.0961379 0.0174445 0.0428165 0.0143948 0.0157172 0.0868296 -0.0547131 -0.1079622 -0.0820493 0.0525693 0.021827 -0.0486837 -0.0099839 -0.0626983 -0.1173464 0.0234154 0.079192 0.0179504 0.1167547 0.013835 0.0868158 0.0114199 0.0743134 unknown
polarizability: 388.354946|-65.635319|138.2785771|-44.8150511|-60.4621302|192.9142496 unknown
InChI: InChI=1S/C10H5Cl3N4S3/c1-18-9-16-10(20-17-9)19-8-14-6-4(12)2-3(11)5(13)7(6)15-8/h2,15H,1H3
charge 0 multiplicity 1
25 atoms
Cl -4.793201 1.954625 -1.377121
Cl -1.998367 -1.804734 3.100165
Cl -6.51205 0.802387 1.217675
S  0.981086 0.386717 -1.689395
S  1.80563 -1.521943 0.858792
S  5.877468 -1.831551 -0.578491
N  -1.713894 0.867612 -1.152604
N  -0.688774 -0.454723 0.397949
N  3.37157 -0.702994 -1.134267
N  3.547962 -2.039365 0.833021
C  -2.695862 0.553678 -0.204912
C  -2.036513 -0.277264 0.763437
C  -0.538876 0.235359 -0.736025
C  -4.052307 0.905528 -0.106306
C  -2.782075 -0.759498 1.8605
C  -4.7633 0.406087 1.001305
C  -4.140491 -0.417793 1.977762
C  2.125042 -0.606786 -0.697736
C  4.124878 -1.506371 -0.256806
C  6.10981 -0.846699 -2.167734
H  -1.849005 1.448841 -1.97998
H  -4.728691 -0.784177 2.822499
H  5.896061 0.215813 -1.98876
H  5.452753 -1.239196 -2.955661
H  7.167941 -0.98915 -2.438208
