program: Gaussian 09
title: 000213001
version: EM64L-G09RevD.01
frameworkgroup: C1[X(C6H12N2O4)]
method: RPBEPBE
basis: SDD
operation: Freq
keyword: #p
keyword: freq=noraman
keyword: PBEPBE/SDD
title: #p freq=noraman PBEPBE/SDD
converged: YES YES NO NO
title: Mulliken charges:
elementType: O O O O N N C C C C C C H H H H H H H H H H H H
charge: -0.299291 -0.299364 -0.280872 -0.280835 -0.617297 -0.617273 -0.025951 -0.318756 -0.318382 -0.709064 0.297295 0.297101 0.219178 0.214645 0.246007 0.214525 0.246102 0.226130 0.225496 0.226009 0.336328 0.340976 0.336321 0.340972
chargesum: 0.00000
title: Mulliken charges with hydrogens summed into heavy atoms:
elementType: O O O O N N C C C C C C
charge: -0.299291 -0.299364 -0.280872 -0.280835 0.060006 0.060020 0.193227 0.141896 0.142245 -0.031428 0.297295 0.297101
polarizability: 1.18901824e+02 3.53749900e-03 8.24114572e+01 -9.54326917e-03 -5.51124511e+00 7.54512404e+01
1716.lowfreq: -9.8255 -6.7955 -3.8431 0.0008 0.0009 0.0010 26.9951 28.4779 47.2475
frequency: 26.9759 28.2073 47.2088 48.8844 63.1185 91.1923 194.7490 211.0230 251.4476 252.1826 296.8834 313.9572 414.8650 429.6635 491.8976 494.8127 504.9576 506.8881 518.0299 520.6456 610.0210 622.0570 698.5391 698.9929 779.8196 815.1823 839.5760 914.8860 929.0339 951.0256 1003.5082 1031.0657 1057.6289 1058.2958 1137.4594 1152.6343 1160.3807 1240.5808 1268.6935 1275.8459 1298.1885 1306.7678 1359.1462 1375.6454 1379.0016 1398.0275 1462.2512 1472.1007 1474.4864 1488.4002 1586.9622 1588.1702 1691.5994 1693.9500 2988.9861 2996.3458 2999.1910 3006.6395 3068.8133 3075.8168 3089.1699 3090.2315 3559.0779 3559.3284 3717.6607 3717.7005
redmass: 6.7990 8.2708 3.9841 3.3153 4.0677 4.5151 5.2168 1.2942 2.4550 8.2186 3.4331 2.4661 1.8526 3.1764 1.2007 1.1806 3.2951 1.9984 1.0548 1.2265 5.4566 5.4843 11.2723 11.3362 4.4046 4.3444 2.8747 1.3926 1.2542 2.0034 7.2074 7.2356 1.9973 2.0120 3.0705 1.9545 2.0431 1.2105 1.1910 1.1798 2.8097 2.7470 1.4016 1.3235 1.5127 1.2836 1.0718 1.0802 1.0774 1.0533 1.2003 1.2038 7.3913 7.5405 1.0360 1.0807 1.0562 1.0598 1.1082 1.1074 1.1001 1.0996 1.0444 1.0445 1.1058 1.1058
irintensity: 0.4054 1.9376 0.3215 0.2934 9.4763 9.1019 9.2309 2.5669 0.0912 2.0930 20.2462 16.1670 2.9776 15.8504 152.2652 470.3581 0.8923 8.9380 29.2921 5.0622 0.1265 4.1808 18.9407 50.0326 32.2386 26.3286 3.8035 2.9846 4.8678 21.5688 397.6730 37.1263 19.2806 6.6439 0.0153 2.9242 0.9437 0.0302 0.5689 19.5247 614.4357 140.4713 0.2458 1.7836 71.9601 34.1062 0.1233 8.9244 16.3756 35.1359 168.5744 40.4239 71.9878 613.1129 17.4323 21.4989 9.1732 63.7178 4.3977 29.3741 29.7465 33.1008 85.1139 44.4534 31.3319 69.6342
temp: 298.150 k
press: 1.00000 atm
elementType: 8 8 8 8 7 7 6 6 6 6 6 6 1 1 1 1 1 1 1 1 1 1 1 1
symmnumber: 1
zpe: 504803.0 jmol-1
zpe.correction: 0.192269 hartree
zpe.thermalcorrener: 0.206123 hartree
zpe.thermalcorrenthalpy: 0.207067 hartree
zpe.thermalcorrgfe: 0.149135 hartree
zpe.sumelectzpe: -645.311418 hartree
zpe.sumelectthermal: -645.297565 hartree
zpe.sumelectthermalent: -645.296621 hartree
zpe.sumelectthermalfe: -645.354552 hartree
dipole: -0.0055 -3.7260 3.0269
dipole: 4.8006
quadrupole: -47.7447 -77.7972 -67.8822
quadrupole: -0.0250 0.0097 3.6030
quadrupole: 16.7300 -13.3225 -3.4075 -0.0250 0.0097 3.6030
hfenergy: -645.5036874 hartree
pointgroup: C01 [X(C6H12N2O4)]
dipole: -0.0216353 -0.5046478 -1.8199019 debye
dipolederiv: -1.4663414 -0.3290536 0.2516584 -0.4822065 -0.4862668 0.1374439 0.5034334 0.1715365 -0.6386803 -1.477734 0.3391153 -0.2343843 0.4905848 -0.4909233 0.1286187 -0.4854583 0.1673401 -0.6233632 -0.6580098 -0.1060737 -0.0146283 -0.138069 -0.4132575 -0.0696067 0.0754349 -0.0678396 -1.058659 -0.6579164 0.1061903 0.0053958 0.1380218 -0.4148408 -0.0730271 -0.0849891 -0.0700995 -1.0575084 -1.158043 -0.1442019 -0.3050207 -0.2368224 -0.8214681 -0.1562778 -0.3215253 -0.1535127 -0.4303947 -1.1419882 0.1431965 0.3190659 0.2356247 -0.8241708 -0.1627884 0.3357186 -0.1583616 -0.4441185 -0.0952615 -0.0002135 0.002504 0.0005451 -0.0069623 0.0226529 0.0021661 -0.0474571 0.1754241 0.837101 0.1331359 -0.0462504 0.1249823 0.3720774 -0.0885109 0.1429531 0.0387391 0.1547843 0.8331648 -0.1355876 0.032072 -0.1297585 0.3738889 -0.0859001 -0.1569581 0.0422484 0.1565176 -0.032579 0.0004483 0.0007411 0.0001973 -0.0809228 0.0439188 0.0005822 0.0467216 0.0365976 1.8995904 0.6533763 0.0544972 0.8339429 0.680796 0.1108686 -0.3657533 0.0258518 1.5718131 1.8972349 -0.6604892 -0.0596181 -0.8385381 0.68996 0.129459 0.3602144 0.0382873 1.5663073 0.0556135 -0.0001654 -0.001733 -0.000169 0.0300284 -0.0061772 -0.0017132 -0.0141612 -0.150417 -0.0146932 -0.0211958 0.0081752 -0.0307138 -0.1426814 0.0785905 -0.0131681 0.1141976 0.0476735 0.0535031 -0.0026073 -0.0044126 -0.0041042 0.082209 0.0061529 -0.0732444 -0.0802579 -0.0361015 -0.014315 0.022529 -0.0062935 0.0315575 -0.1438136 0.0775398 0.0155701 0.1131587 0.0479251 0.0553255 0.001272 0.002702 0.0045343 0.08236 0.0064723 0.0711069 -0.0800668 -0.0375722 -0.0650849 0.1437483 0.0465442 0.1364241 0.0138562 -0.0084125 0.0491757 -0.0235497 0.066348 0.1169182 -0.0004051 -0.0015823 -0.0007536 0.0574553 -0.0609079 -0.0012422 -0.0070523 -0.1090947 -0.0678826 -0.1435903 -0.0449176 -0.1359736 0.0152897 -0.005993 -0.0476999 -0.0213061 0.0674246 0.2742381 -0.0866748 0.0114673 -0.0845941 0.3540364 -0.0070515 0.0413492 0.0030666 0.1784544 0.276114 -0.0735745 0.0186377 -0.0800462 0.3606029 -0.003201 -0.020867 -0.0184679 0.1685049 0.2740886 0.0871725 -0.0135849 0.0848266 0.3530341 -0.0089412 -0.0434449 0.0013079 0.179569 0.2769571 0.0736484 -0.0210351 0.0805076 0.359713 -0.0049218 0.018359 -0.0203232 0.1685662 unknown
polarizability: 118.8983726|-0.1340556|72.523851|-0.3172045|1.1942742|85.342298 unknown
InChI: InChI=1S/C6H12N2O4/c1-4(2-11-5(7)9)3-12-6(8)10/h4H,2-3,7-8H2,1H3
charge 0 multiplicity 1
24 atoms
O  -2.467782 0.166767 -0.556765
O  2.461942 0.149068 -0.603855
O  -3.221999 -0.13986 1.667551
O  3.262253 -0.160463 1.603909
N  -4.423899 -0.922907 -0.190731
N  4.419035 -0.951839 -0.279317
C  -0.00176 0.003102 -0.424167
C  -1.243956 0.845773 -0.068259
C  1.25294 0.835873 -0.089757
C  -0.000862 -1.357825 0.302098
C  -3.36811 -0.292015 0.430315
C  3.380659 -0.314298 0.363936
H  -0.011702 -0.169778 -1.519151
H  -1.226577 1.82426 -0.581519
H  -1.334668 0.994373 1.024112
H  1.23272 1.816089 -0.599671
H  1.365848 0.980475 1.001072
H  0.888607 -1.948083 0.020725
H  0.00606 -1.223258 1.399248
H  -0.89673 -1.943505 0.031648
H  -4.459208 -0.991298 -1.204741
H  -5.170615 -1.302219 0.383861
H  4.431924 -1.02114 -1.293798
H  5.175779 -1.335187 0.279254
