program: Gaussian 09
title: 000213072
version: EM64L-G09RevD.01
frameworkgroup: C1[X(C23H22N2O4)]
method: RPBEPBE
basis: SDD
operation: Freq
keyword: #p
keyword: freq=noraman
keyword: PBEPBE/SDD
title: #p freq=noraman PBEPBE/SDD
converged: YES YES NO NO
title: Mulliken charges:
elementType: O O O O N N C C C C C C C C C C C C C C C C C C C C C C C H H H H H H H H H H H H H H H H H H H H H H
charge: -0.326904 -0.308052 -0.267486 -0.280782 -0.463669 -0.613928 0.056605 -0.342938 0.423769 0.465937 -0.400385 -0.427473 -0.390770 -0.351346 -0.423042 -0.252049 -0.242203 -0.243682 -0.246028 -0.246160 -0.247235 0.257420 0.311913 0.488139 -0.448339 -0.356368 -0.195641 -0.211955 -0.257563 0.241084 0.254040 0.262173 0.236041 0.243871 0.247608 0.242982 0.238134 0.224501 0.226430 0.227241 0.224721 0.228270 0.229350 0.331698 0.337673 0.340537 0.223016 0.299196 0.226498 0.226225 0.228927
chargesum: 0.00000
title: Mulliken charges with hydrogens summed into heavy atoms:
elementType: O O O O N N C C C C C C C C C C C C C C C C C C C C C C C
charge: -0.326904 -0.308052 -0.267486 -0.280782 -0.131971 0.064282 0.056605 0.152185 0.423769 0.465937 0.097829 -0.183602 -0.143162 -0.108364 -0.184908 -0.027548 -0.015773 -0.016441 -0.021307 -0.017890 -0.017884 0.257420 0.311913 0.488139 -0.225323 -0.057172 0.030857 0.014270 -0.028636
polarizability: 3.37332645e+02 8.34442487e+00 2.51915696e+02 2.23708715e+01 4.43544308e+01 2.24937881e+02
1716.lowfreq: -4.4701 -0.0008 -0.0003 0.0005 4.1159 5.9846 9.5094 21.6989 27.2070
frequency: 9.2814 21.6336 27.1616 28.0347 33.1339 44.2964 50.7165 56.1789 62.6082 71.2471 78.3713 111.7592 118.1776 149.1437 168.5671 184.4630 238.2725 238.5629 244.1638 252.0349 267.8761 287.3093 308.1922 337.8610 348.9679 396.4023 400.4346 403.5024 408.0753 434.6139 477.8971 492.6461 496.4900 509.3786 513.3067 535.5519 597.1763 607.0748 614.7181 617.0113 618.1400 621.7692 627.2654 641.4687 692.9415 696.1378 696.5762 701.3992 703.6701 706.1409 737.0050 765.9803 766.4229 782.7238 797.6920 827.6617 841.5234 851.2974 854.3839 854.8954 907.7468 913.6237 918.0257 924.2114 938.8967 971.5644 976.2827 979.6061 984.5063 991.1208 991.7215 994.5387 995.9948 997.0366 998.3082 1015.5712 1023.5226 1028.3526 1035.6100 1039.7284 1059.5081 1077.8513 1084.7931 1090.3922 1095.6690 1156.4299 1165.2877 1172.7266 1173.6119 1174.5426 1189.9387 1195.3845 1197.2658 1200.2008 1207.5067 1256.4260 1259.6569 1281.2135 1299.9111 1325.0963 1325.9135 1329.8633 1357.4922 1370.2913 1378.7240 1382.0263 1387.0643 1434.1249 1435.1119 1436.2920 1473.5196 1478.9486 1485.8443 1486.5316 1489.6394 1519.3520 1588.3284 1590.1145 1592.8298 1601.5359 1611.7471 1615.2395 1617.9450 1664.9508 1694.3198 3013.9117 3024.5626 3088.2530 3098.6066 3114.2356 3118.6580 3122.9537 3125.8803 3128.9250 3132.6140 3139.3657 3141.9402 3144.7318 3151.8168 3152.8268 3164.4792 3165.4941 3165.5360 3189.1065 3539.8742 3559.8915 3717.9582
redmass: 5.9602 5.1856 5.0840 4.8288 5.5123 5.3031 4.2925 5.9298 5.2039 5.2733 5.3317 6.0761 5.9366 6.9637 6.0528 5.0249 5.4538 5.1115 5.6134 4.3622 5.5864 2.8341 4.6201 6.6018 2.4558 6.8276 2.8134 2.8241 2.9213 3.9375 3.2219 1.3795 2.3720 2.7906 1.0803 3.5225 5.6825 4.6008 6.2026 6.3978 6.4450 4.7260 5.2926 1.3010 5.9747 2.1802 9.5565 4.7455 1.6883 1.7223 3.3621 1.9603 1.7453 2.9234 2.8708 5.3682 1.2661 1.2719 2.2329 1.3991 2.9873 1.4335 2.0036 1.4744 2.5358 1.3549 1.4049 1.4002 6.1128 4.8028 6.0664 1.4019 1.3066 1.4177 3.1852 4.6175 3.8941 2.6282 2.6520 2.3823 1.9945 1.8546 1.7838 1.5570 1.8856 3.4021 2.8473 1.0505 1.0627 1.0775 1.1134 1.4558 2.2956 1.2722 1.6580 1.2399 2.0933 1.2494 2.6780 1.3842 1.3706 1.3515 1.4533 2.0198 4.7802 3.3866 6.5662 2.3385 2.2657 2.2445 1.1633 1.2323 2.0689 2.0686 1.7945 2.1552 1.4641 3.2227 5.7544 5.2341 6.0008 5.9612 6.0382 8.8412 7.5531 1.0572 1.0567 1.1072 1.1082 1.0882 1.0858 1.0846 1.0870 1.0879 1.0869 1.0926 1.0924 1.0935 1.0948 1.0952 1.1008 1.1004 1.1004 1.0953 1.0761 1.0446 1.1057
irintensity: 0.3806 0.6201 0.8403 1.2538 0.1259 2.6947 0.3965 7.2982 0.5083 0.4790 3.1238 0.9273 1.1490 1.8320 1.6803 1.1770 9.3888 0.9337 7.5240 1.8713 3.4542 18.0968 1.3139 2.0857 13.4122 0.6487 0.1356 0.0221 0.0049 2.5967 9.8600 227.9193 45.7027 23.6053 29.0488 33.2308 9.3641 4.5325 5.1468 0.0907 2.6394 6.3564 3.7655 24.9202 10.6094 15.8152 45.2900 44.9508 44.1808 71.3756 45.3187 9.9357 117.4238 33.7182 13.7341 7.2301 0.3375 0.2249 1.7007 0.2810 12.1504 12.6543 9.8512 1.9214 0.6141 0.0668 0.4206 0.4743 7.5650 3.0596 0.2555 4.7570 1.6125 30.7707 203.9049 211.9436 81.9992 14.9934 79.2807 38.7732 14.4308 7.4823 5.6432 38.8384 2.6692 447.7583 146.4803 0.5181 0.8768 1.5078 6.9822 0.3539 1.2073 0.8020 1.4163 15.9122 4.6884 5.2422 352.3116 51.2883 8.7323 1.9078 6.7509 63.2679 9.9285 30.8541 46.4509 125.2357 16.8001 5.9735 10.5943 40.7999 6.3781 23.7880 57.5162 548.3436 91.6464 21.2310 1.6913 32.3720 8.1553 6.3180 107.4538 196.0287 295.7275 25.2423 26.8823 13.9904 14.1934 14.1046 4.5641 2.8442 0.2750 1.0031 0.7094 19.5060 25.7823 30.4718 38.4814 36.9464 19.4382 37.7335 3.2895 6.6430 23.3885 62.6875 51.6341
temp: 298.150 k
press: 1.00000 atm
elementType: 8 8 8 8 7 7 6 6 6 6 6 6 6 6 6 6 6 6 6 6 6 6 6 6 6 6 6 6 6 1 1 1 1 1 1 1 1 1 1 1 1 1 1 1 1 1 1 1 1 1 1
symmnumber: 1
zpe: 1057894.4 jmol-1
zpe.correction: 0.402931 hartree
zpe.thermalcorrener: 0.429180 hartree
zpe.thermalcorrenthalpy: 0.430124 hartree
zpe.thermalcorrgfe: 0.341602 hartree
zpe.sumelectzpe: -1298.013031 hartree
zpe.sumelectthermal: -1297.986782 hartree
zpe.sumelectthermalent: -1297.985838 hartree
zpe.sumelectthermalfe: -1298.074359 hartree
dipole: 0.2434 0.0210 0.0994
dipole: 0.2638
quadrupole: -160.7885 -147.6104 -168.9558
quadrupole: 9.5352 16.7229 6.6088
quadrupole: -1.6703 11.5079 -9.8376 9.5352 16.7229 6.6088
hfenergy: -1298.4159617 hartree
pointgroup: C01 [X(C23H22N2O4)]
dipole: 0.0961764 -0.0106529 -0.037495 debye
polarizability: 336.7188395|-14.3264486|240.7423634|-16.9701403|47.7756249|236.7250198 unknown
InChI: InChI=1S/C23H22N2O4/c24-21(26)28-16-23(18-10-4-1-5-11-18,19-12-6-2-7-13-19)17-29-22(27)25-20-14-8-3-9-15-20/h1-15,25H,16-17,24H2
charge 0 multiplicity 1
51 atoms
O  0.974169 -0.064404 0.044422
O  -1.481004 2.299392 -0.956876
O  2.251451 0.910617 1.768566
O  -3.374164 2.605519 -2.345106
N  3.220119 -0.193064 -0.099598
N  -2.551158 4.300663 -0.945225
C  -1.460783 -0.026457 -0.121926
C  -0.251345 0.297922 0.791994
C  -2.787355 0.270628 0.622184
C  -1.394878 -1.522179 -0.524242
C  -1.383685 0.886966 -1.379924
C  -2.842206 0.940067 1.870404
C  -1.669299 -2.507378 0.460875
C  -4.010664 -0.116736 0.014442
C  -1.03865 -1.958234 -1.82472
C  -4.082446 1.204159 2.497759
C  -1.583646 -3.882396 0.16123
C  -5.24858 0.151924 0.632253
C  -0.960393 -3.336777 -2.132008
C  -5.290976 0.813111 1.882331
C  -1.228083 -4.305824 -1.141022
C  2.182393 0.28296 0.682871
C  -2.560667 3.039028 -1.493787
C  4.617567 -0.065986 0.132977
C  5.492393 -0.658955 -0.816697
C  5.153978 0.617946 1.255999
C  6.888661 -0.569956 -0.64711
C  6.554896 0.697743 1.409566
C  7.430949 0.110058 0.468367
H  -0.280136 -0.288331 1.727647
H  -0.20765 1.373382 1.033064
H  -2.199948 0.672362 -2.091409
H  -0.404313 0.787369 -1.875149
H  -1.926256 1.266041 2.373292
H  -1.968298 -2.193113 1.468159
H  -3.992277 -0.63856 -0.949358
H  -0.818204 -1.235184 -2.616176
H  -4.100497 1.717852 3.465789
H  -1.800254 -4.622961 0.939387
H  -6.178371 -0.152866 0.139395
H  -0.689546 -3.650672 -3.146671
H  -6.251718 1.019968 2.366925
H  -1.165954 -5.373617 -1.378726
H  2.9265 -0.707938 -0.93284
H  -1.859921 4.552199 -0.243075
H  -3.266055 4.962076 -1.233239
H  5.079338 -1.18866 -1.68479
H  4.479467 1.069953 1.985985
H  7.551622 -1.032312 -1.386743
H  6.962844 1.22621 2.278589
H  8.515735 0.179152 0.60065
