program: Gaussian 09
title: 000213104
version: EM64L-G09RevD.01
frameworkgroup: C1[X(C20H27NO8)]
method: RPBEPBE
basis: SDD
operation: Freq
keyword: #p
keyword: freq=noraman
keyword: PBEPBE/SDD
title: #p freq=noraman PBEPBE/SDD
converged: YES YES NO NO
title: Mulliken charges:
elementType: O O O O O O O O N C C C C C C C C C C C C C C C C C C C C H H H H H H H H H H H H H H H H H H H H H H H H H H H
charge: -0.265072 -0.273671 -0.294257 -0.313355 -0.245743 -0.199554 -0.256703 -0.235054 -0.138710 -0.266941 -0.041585 -0.499932 -0.379203 0.462538 -0.402963 0.298263 -0.457800 -0.255230 0.206411 -0.450456 0.270178 -0.760438 0.218657 -0.725270 -0.749301 0.346901 0.329470 -0.781663 -0.766715 0.271048 0.258555 0.231483 0.241651 0.184192 0.230217 0.230830 0.200412 0.256403 0.283289 0.281053 0.244663 0.258256 0.223144 0.264430 0.218887 0.223869 0.266999 0.217323 0.271977 0.270825 0.262423 0.244178 0.244634 0.260964 0.240418 0.245074
chargesum: 0.00000
title: Mulliken charges with hydrogens summed into heavy atoms:
elementType: O O O O O O O O N C C C C C C C C C C C C C C C C C C C C
charge: -0.265072 -0.273671 -0.294257 -0.313355 -0.245743 -0.199554 -0.256703 -0.235054 -0.138710 0.004108 0.216970 -0.026798 0.035206 0.462538 0.028279 0.298263 -0.201397 0.028059 0.206411 0.075260 0.270178 -0.014608 0.218657 -0.015515 0.010824 0.346901 0.329470 -0.030428 -0.020259
polarizability: 2.98210315e+02 4.27110594e+00 2.33912106e+02 2.02892468e+01 5.42535742e+00 1.95289378e+02
1716.lowfreq: -13.3947 -6.9856 -0.0009 -0.0005 -0.0003 2.2174 21.8509 41.1057 46.8413
frequency: 21.5377 41.0704 46.7975 51.3668 65.3564 73.2011 85.9336 91.2454 96.9224 106.0933 107.5062 119.2054 140.3768 146.3216 156.2137 165.9158 175.3539 180.0862 197.1674 203.6865 213.0892 218.2605 223.6501 235.4772 236.9534 252.1642 256.9691 287.7820 300.3460 319.2343 325.8677 338.2760 342.3475 351.6979 362.7375 366.0576 388.2507 423.1692 451.1145 468.9817 496.1885 510.0088 514.6995 528.3191 547.5737 556.2782 558.9477 565.9002 610.1951 632.4588 644.9515 665.9009 698.0819 706.1307 714.6409 761.3604 781.7524 793.7758 808.3043 827.4632 830.2817 855.2552 861.1399 878.5630 897.5715 901.5690 916.8281 918.2571 936.7633 964.6098 973.1175 991.9614 994.2565 995.2605 1001.2767 1003.3373 1012.5329 1037.0711 1038.0857 1049.5852 1062.2402 1069.8595 1079.8623 1089.8428 1096.7189 1105.9789 1110.3341 1114.1976 1130.4481 1136.4982 1155.5545 1162.5637 1173.0008 1177.4526 1185.5166 1193.1049 1200.1609 1206.5129 1208.6596 1223.1856 1239.0225 1276.0801 1280.4717 1291.6061 1303.0669 1307.0770 1324.6603 1334.5988 1346.1645 1349.3764 1356.7465 1375.8162 1380.3665 1380.9358 1383.7563 1404.3567 1451.5114 1451.9689 1453.8447 1454.0079 1459.2811 1464.8867 1466.2599 1469.1334 1470.7722 1475.3885 1478.7390 1486.4210 1490.4802 1502.3820 1616.9004 1637.4119 1645.5584 1669.6409 1672.7677 2887.3284 2914.4799 2966.2424 2974.3291 3001.6248 3005.7233 3006.0312 3008.3414 3010.9414 3015.4561 3017.6497 3021.9227 3029.0828 3044.9001 3074.3797 3095.1355 3097.2404 3098.5408 3101.3728 3112.4634 3121.8555 3126.3857 3137.8269 3140.0021 3141.5990 3149.5003 3161.0393
redmass: 2.1153 3.6479 1.9182 3.7443 4.1859 3.2918 3.2129 1.6482 3.1680 3.0724 3.6061 6.3009 7.9430 3.5285 2.3652 2.9245 3.2755 2.8339 1.4575 2.6927 1.7458 3.0059 2.6245 2.8300 2.6603 4.1638 4.2171 3.4984 3.5906 2.3871 3.3733 2.6674 3.5029 7.2693 3.7742 3.6861 3.5278 3.7106 5.0255 3.6552 3.9456 4.1168 4.3615 4.2489 4.4013 3.3284 3.7972 3.5407 4.5804 4.2505 4.7611 4.9749 4.4259 5.8268 5.3476 4.4586 4.4337 1.5129 3.4410 2.8770 1.9533 3.5555 3.1392 4.6029 2.6439 4.7457 2.5827 3.1219 3.4083 2.2841 2.0966 2.1580 1.9265 1.8547 1.7213 1.9441 1.7211 1.6875 1.6547 2.2420 3.6956 3.7409 3.0099 4.2463 2.4721 2.2418 2.2647 2.1746 2.6827 2.3334 2.4891 1.7024 2.8253 1.3948 3.5188 1.3923 1.4693 3.6616 3.2152 1.6993 1.2048 1.2450 1.3484 1.3824 1.4450 1.4033 1.6330 1.7615 1.5525 1.4848 1.4086 1.1929 1.2351 1.2407 1.1836 1.1851 1.0612 1.0582 1.0513 1.0523 1.0529 1.0805 1.0573 1.0941 1.0445 1.0526 1.0838 1.0490 1.0524 1.0843 9.7218 11.1380 9.0681 9.8520 7.8136 1.0719 1.0668 1.0928 1.0835 1.0594 1.0374 1.0373 1.0795 1.0386 1.0742 1.0375 1.0366 1.0788 1.0853 1.1041 1.1036 1.0952 1.0955 1.0992 1.0979 1.0980 1.1006 1.1019 1.1019 1.0996 1.1003 1.0967
irintensity: 0.6898 1.3961 0.6737 1.4146 0.4954 5.1997 2.6903 1.2917 0.5303 1.7313 0.2296 2.2557 0.9175 2.7578 4.2602 1.7306 0.8883 0.5762 0.6538 2.2256 0.2314 2.2875 2.7015 4.7489 0.1680 1.5434 5.1516 3.9613 5.5377 4.0461 10.0826 0.2018 7.5856 6.6475 2.1470 4.5982 7.8032 7.4848 4.5829 1.4329 13.2888 4.6365 5.0500 3.5764 2.8673 3.4346 5.1212 21.7043 4.3292 4.2280 5.2301 5.0678 3.1058 10.6052 7.0176 3.4021 13.0618 29.7771 0.3795 8.4393 9.2258 13.5636 2.4838 13.1536 9.4610 22.4000 26.9228 61.2332 34.5746 3.8856 5.6329 16.6853 130.8980 13.9558 6.3598 2.2205 42.4518 1.3119 16.4105 69.4071 2.8303 28.1698 175.7224 348.1063 31.8459 131.1777 30.0666 7.7592 19.9199 55.7501 195.1255 58.9944 6.5412 1.4399 392.0589 7.7342 2.7671 76.0436 141.3726 0.3790 0.9919 2.2805 5.7221 2.4264 10.9646 22.4233 20.7344 14.8201 0.4643 4.0270 8.6537 25.2306 66.2763 45.6070 30.6823 33.8365 15.7511 31.5626 7.2775 25.6592 12.0417 25.7523 26.2519 7.2626 20.6544 5.3992 4.0841 12.5269 4.6445 4.5584 55.1910 222.8956 200.3098 153.7169 6.1793 88.9538 101.9685 49.5295 26.2161 8.4688 1.7594 2.4070 5.3689 23.6448 18.1951 4.9449 21.3342 61.5900 11.5766 11.4060 28.7920 7.3978 7.6876 27.3782 9.7481 12.1610 10.4457 8.6887 10.6289 6.0598 2.6244 10.5286
temp: 298.150 k
press: 1.00000 atm
elementType: 8 8 8 8 8 8 8 8 7 6 6 6 6 6 6 6 6 6 6 6 6 6 6 6 6 6 6 6 6 1 1 1 1 1 1 1 1 1 1 1 1 1 1 1 1 1 1 1 1 1 1 1 1 1 1 1
symmnumber: 1
zpe: 1172989.8 jmol-1
zpe.correction: 0.446768 hartree
zpe.thermalcorrener: 0.476490 hartree
zpe.thermalcorrenthalpy: 0.477434 hartree
zpe.thermalcorrgfe: 0.387496 hartree
zpe.sumelectzpe: -1432.631170 hartree
zpe.sumelectthermal: -1432.601448 hartree
zpe.sumelectthermalent: -1432.600504 hartree
zpe.sumelectthermalfe: -1432.690442 hartree
dipole: -2.1056 0.7515 -0.6640
dipole: 2.3322
quadrupole: -146.4873 -179.6023 -172.0798
quadrupole: 13.7335 1.3546 -1.9529
quadrupole: 19.5692 -13.5458 -6.0233 13.7335 1.3546 -1.9529
hfenergy: -1433.077938 hartree
pointgroup: C01 [X(C20H27N1O8)]
dipole: -0.8305743 -0.2737008 0.2777976 debye
polarizability: 298.3400825|-5.9191341|234.522335|-19.4828067|2.7058419|194.5493819 unknown
InChI: InChI=1S/C20H27NO8/c1-11-17(24)27-15-7-9-21-8-6-14(16(15)21)10-26-18(25)20(5,29-13(3)23)19(11,4)28-12(2)22/h6,11,15-16H,7-10H2,1-5H3
charge 0 multiplicity 1
56 atoms
O  -1.326426 -1.168524 -0.940735
O  0.054757 1.420811 0.541345
O  0.448155 -1.545606 1.210483
O  3.487116 0.187067 0.098709
O  -0.233624 0.276826 -2.400846
O  1.767839 2.042549 -0.908372
O  0.005196 -3.755716 0.536554
O  4.042374 2.291403 1.005591
N  -4.166091 0.588087 0.55634
C  -2.688999 0.540358 0.271541
C  -2.552844 -0.329325 -1.017776
C  -3.807299 -1.21771 -0.983389
C  -4.888056 -0.248663 -0.446799
C  -2.265369 2.002445 0.199878
C  -4.594398 2.010532 0.69893
C  1.587477 -1.318611 0.250127
C  -3.323303 2.812669 0.460104
C  1.066213 -1.488405 -1.238489
C  2.110642 0.142755 0.670765
C  -0.859053 2.41229 -0.12807
C  -0.186093 -0.676935 -1.588954
C  2.683629 -2.369978 0.544665
C  1.326737 1.305954 -0.005548
C  2.153927 -1.23096 -2.307016
C  2.129178 0.321799 2.205808
C  -0.239471 -2.764463 1.259824
C  4.30681 1.327137 0.262174
C  -1.318537 -2.696034 2.317995
C  5.53513 1.177196 -0.605953
H  -2.123278 0.026875 1.074452
H  -2.497612 0.289941 -1.93027
H  -3.643904 -2.051481 -0.277076
H  -4.063781 -1.640773 -1.968232
H  -5.29498 0.37323 -1.280705
H  -5.736583 -0.791016 0.008437
H  -5.013694 2.215044 1.706042
H  -5.390491 2.267691 -0.037348
H  -3.297261 3.905672 0.50959
H  0.753706 -2.549903 -1.279652
H  -0.645832 2.363205 -1.213023
H  -0.610246 3.421267 0.242514
H  3.610034 -2.122906 0.008439
H  2.908604 -2.390765 1.624511
H  2.332561 -3.368792 0.244079
H  3.035639 -1.86787 -2.131217
H  1.748507 -1.471281 -3.305108
H  2.470576 -0.177112 -2.31777
H  2.768578 -0.448304 2.669179
H  2.528174 1.314061 2.46086
H  1.10775 0.221055 2.596652
H  -2.185818 -2.13803 1.921055
H  -0.962553 -2.162649 3.214019
H  -1.642443 -3.714529 2.578972
H  5.267361 1.436484 -1.646494
H  5.901221 0.137951 -0.602332
H  6.320851 1.864584 -0.259459
