program: Gaussian 09
title: 000213049
version: EM64L-G09RevD.01
frameworkgroup: C1[X(C21H21F2N3O7)]
method: RPBEPBE
basis: SDD
operation: Freq
keyword: #p
keyword: freq=noraman
keyword: PBEPBE/SDD
title: #p freq=noraman PBEPBE/SDD
converged: YES YES NO NO
title: Mulliken charges:
elementType: F F O O O O O O O N N N C C C C C C C C C C C C C C C C C C C C C H H H H H H H H H H H H H H H H H H H H H
charge: -0.189178 -0.190748 -0.241733 -0.239027 -0.220668 -0.314199 -0.457565 -0.461236 -0.171380 -0.114315 -0.287544 -0.048729 -0.525941 -0.428554 0.336463 -0.115545 -0.409936 -0.471882 -0.050924 -0.336525 0.514270 -0.310132 0.252542 0.170980 0.227513 0.265782 -0.572916 -0.537782 -0.151161 -0.345244 0.215553 -0.331784 -0.129689 0.249662 0.256972 0.275920 0.233458 0.274346 0.265865 0.271525 0.279495 0.240978 0.252059 0.251929 0.226050 0.279626 0.330781 0.238285 0.207800 0.251386 0.366757 0.372957 0.270356 0.275025
chargesum: 0.00000
title: Mulliken charges with hydrogens summed into heavy atoms:
elementType: F F O O O O O O O N N N C C C C C C C C C C C C C C C C C C C C C
charge: -0.189178 -0.190748 -0.241733 -0.239027 -0.220668 -0.314199 -0.090808 -0.088279 -0.171380 -0.114315 -0.287544 -0.048729 -0.019307 0.080825 0.336463 0.158801 0.127454 0.048591 -0.050924 -0.084466 0.514270 0.167847 0.252542 0.170980 0.227513 0.265782 -0.293289 -0.207000 0.087125 0.113942 0.215553 -0.061428 0.145336
polarizability: 3.83527437e+02 -1.40446770e+00 2.46896886e+02 -4.50119146e+00 1.75508415e+01 2.11131976e+02
1716.lowfreq: -2.8860 -0.0006 0.0007 0.0011 1.9836 7.2543 8.4564 16.7296 19.0800
frequency: 8.0992 16.6333 18.8911 30.3223 30.9698 38.7937 53.7317 55.8549 64.7486 72.3764 83.2045 100.8879 120.8416 130.6423 136.9720 146.8652 157.1461 174.9683 181.9072 205.9422 222.8166 229.9898 242.6700 256.1266 273.0438 279.8731 295.3560 301.8930 309.2467 312.0186 329.9537 346.5588 370.1383 388.2864 407.5681 422.1053 433.7771 448.4302 463.9991 483.8137 497.2297 502.4980 533.1245 546.8139 552.7061 558.5895 562.2189 567.2428 622.9152 627.8446 646.4768 654.4015 666.4832 676.9761 693.3557 705.1469 724.1176 738.4226 740.9395 760.7752 774.7808 809.4821 829.0017 830.1996 839.1198 847.5379 867.3352 878.0617 882.5338 896.9189 934.7669 937.3934 947.4875 954.6520 956.7000 966.5656 977.9515 982.8484 987.3837 992.6872 995.8695 1001.7575 1012.9891 1024.4753 1026.8364 1058.9061 1074.0518 1079.1226 1091.4561 1103.5013 1121.9724 1137.0736 1165.5981 1174.4547 1181.4785 1193.6560 1200.1869 1217.6260 1228.6515 1230.8716 1232.5200 1245.7510 1252.0694 1269.7036 1271.5236 1284.9407 1302.4840 1319.1816 1329.2900 1332.4412 1337.2441 1346.3428 1354.3944 1357.5721 1363.0561 1369.2103 1380.5447 1385.7439 1387.9141 1426.3540 1432.0625 1434.1117 1456.2663 1457.4902 1461.8918 1463.6542 1477.2421 1496.9460 1502.8307 1539.9441 1557.5117 1577.4044 1639.5775 1669.8536 1703.6100 2951.4160 2981.7692 2983.6372 2990.9449 3002.5710 3005.7513 3034.1550 3048.0888 3056.8685 3070.5854 3073.6481 3096.3206 3098.2414 3106.4900 3135.9623 3191.7439 3196.1136 3235.5340 3262.0151 3365.1525 3561.8296
redmass: 7.9868 7.7808 6.9935 5.5338 7.8241 7.1588 6.9562 8.5077 8.0321 6.1795 7.0112 4.2291 5.6861 3.2052 3.7707 4.2885 7.6151 4.6516 5.4667 4.9857 5.0122 4.5993 4.8338 3.4828 7.3236 6.2715 6.8534 9.8078 7.6412 3.2631 3.1072 1.8677 3.6938 3.4058 3.3645 2.8262 2.9684 3.1751 4.9408 4.8691 5.4784 7.5455 3.0825 1.4542 5.0568 5.1717 4.5993 4.7641 4.3628 3.7495 5.7399 7.9338 4.7675 10.5376 5.2848 6.8131 3.6099 4.1570 4.8718 1.2683 2.2211 7.5740 8.1756 1.3141 1.6601 1.4240 7.4981 3.4877 2.7098 1.4199 4.0254 4.7830 1.9137 3.0898 3.5567 4.5721 4.1268 2.4597 2.4064 3.7012 2.5949 2.9899 3.2525 8.5478 3.6233 2.4444 2.1151 2.0246 1.8259 1.3609 1.8498 1.1762 1.7229 2.0673 3.8744 1.9134 1.4565 1.5729 1.3400 1.2740 1.2385 2.1067 1.7950 1.7682 1.3188 1.2751 1.3952 1.1738 1.4452 1.8032 2.0727 1.3966 2.0148 2.0349 1.5414 2.7883 3.1132 1.4452 2.1329 3.5974 2.4477 4.7434 1.0910 1.1611 1.1281 1.1200 1.1034 1.8315 1.6661 5.5920 8.8324 5.4786 8.3749 7.1283 12.0526 1.0693 1.0574 1.0646 1.0652 1.0612 1.0660 1.0851 1.0957 1.1059 1.1041 1.0908 1.1014 1.0911 1.0987 1.0926 1.0919 1.0931 1.0910 1.1107 1.0639 1.0674
irintensity: 0.2506 0.1794 0.5320 10.2799 1.7719 0.2170 1.1812 0.1995 6.5083 0.5957 5.4003 2.9169 1.4870 6.9460 3.1929 4.1065 1.0464 3.2376 0.5164 11.3687 6.8943 2.8475 0.6595 14.3638 4.7760 1.3142 0.0246 6.1264 4.0593 2.5978 20.2827 94.9493 42.9494 3.9341 13.5036 3.7451 12.0224 18.5622 21.5974 11.6084 19.8321 7.2086 20.4139 63.5406 3.4381 13.3441 9.7387 10.5215 7.1211 8.8806 11.4612 1.0129 1.8240 14.1231 4.1155 40.7921 9.7775 18.1156 2.0251 75.3314 1.0632 33.1223 11.3432 7.8945 34.8586 1.2456 3.7994 7.4323 46.8346 39.1787 20.2195 6.0322 6.7262 59.4311 34.2916 138.4109 109.7974 2.6182 6.3290 32.7666 108.8842 38.5471 15.1681 91.6475 48.6495 58.5669 6.3931 93.7804 15.7035 21.6068 39.0032 16.8751 20.2153 6.1006 396.6507 36.5732 51.9818 9.1648 95.1946 27.0156 31.8156 23.9571 35.4726 83.5691 11.6308 3.8131 1.7483 23.9663 7.9913 61.8769 20.5204 21.2663 20.6969 9.8689 34.5077 62.8268 182.2386 142.5475 36.3194 228.2200 14.1245 42.2091 20.7367 15.5842 11.1558 39.1160 18.8050 215.7382 33.7440 149.4588 75.0726 247.5913 279.5723 1.7028 370.1604 44.5540 24.0821 11.6617 27.9950 15.9184 33.4968 36.3287 14.7941 18.0572 8.7520 2.0914 20.4500 24.4812 2.1229 10.2828 3.3663 20.8450 0.0526 0.7675 55.5289 43.2724
temp: 298.150 k
press: 1.00000 atm
elementType: 9 9 8 8 8 8 8 8 8 7 7 7 6 6 6 6 6 6 6 6 6 6 6 6 6 6 6 6 6 6 6 6 6 1 1 1 1 1 1 1 1 1 1 1 1 1 1 1 1 1 1 1 1 1
symmnumber: 1
zpe: 1055747.5 jmol-1
zpe.correction: 0.402113 hartree
zpe.thermalcorrener: 0.432559 hartree
zpe.thermalcorrenthalpy: 0.433503 hartree
zpe.thermalcorrgfe: 0.335729 hartree
zpe.sumelectzpe: -1700.824326 hartree
zpe.sumelectthermal: -1700.793881 hartree
zpe.sumelectthermalent: -1700.792937 hartree
zpe.sumelectthermalfe: -1700.890711 hartree
dipole: 7.0513 -0.2839 -1.2435
dipole: 7.1657
quadrupole: -222.6442 -222.3787 -181.0092
quadrupole: 6.1047 42.4083 -12.9129
quadrupole: -13.9668 -13.7014 27.6682 6.1047 42.4083 -12.9129
hfenergy: -1701.2264393 hartree
pointgroup: C01 [X(C21H21F2N3O7)]
dipole: 2.7721425 -0.172101 -0.4832348 debye
polarizability: 383.4072751|-4.6277768|246.6850529|-3.6540543|17.9917678|211.4639715 unknown
InChI: InChI=1S/C21H21F2N3O7/c22-15-7-13(26-9-14(33-21(26)30)11-31-18-3-6-32-24-18)8-16(23)19(15)12-1-4-25(5-2-12)20(29)17(28)10-27/h1,3,6-8,14,17,27-28H,2,4-5,9-11H2
charge 0 multiplicity 1
54 atoms
F  -0.881449 -1.579935 -2.59514
F  -2.321056 1.852851 0.49809
O  4.249539 2.647901 -0.115609
O  5.96913 -0.601865 -0.441286
O  2.187116 3.3923 0.689023
O  -6.63792 -2.314042 0.993424
O  -8.456348 -0.560021 1.72886
O  -5.621858 1.805171 1.056535
O  7.861072 -3.355571 0.709918
N  -5.794747 -1.067462 -0.779737
N  2.391036 1.41636 -0.653541
N  7.138102 -2.628883 -0.339292
C  -3.432649 -1.79419 -0.825432
C  -4.887782 -2.165201 -1.189394
C  -3.118487 -0.344867 -1.193411
C  4.750288 1.417763 -0.784477
C  3.489386 0.741705 -1.380727
C  -5.575919 0.182586 -1.533902
C  -1.704223 0.111669 -1.071783
C  -4.098346 0.530329 -1.557148
C  1.037681 1.003083 -0.775189
C  5.460516 0.576169 0.283841
C  2.837598 2.55757 0.039769
C  -6.569448 -1.208119 0.348213
C  -0.613289 -0.499674 -1.729365
C  -1.315796 1.197463 -0.246398
C  0.723955 -0.099735 -1.615143
C  -0.008261 1.662437 -0.073661
C  -7.388315 -0.015546 0.898838
C  -6.538515 0.932552 1.802875
C  6.700046 -1.512427 0.30127
C  7.082047 -1.457604 1.693873
C  7.797779 -2.620834 1.891868
H  -3.266756 -1.944634 0.259912
H  -2.735661 -2.475159 -1.3477
H  -5.207008 -3.086061 -0.677919
H  -4.985178 -2.303049 -2.28298
H  5.46688 1.723184 -1.561309
H  3.403271 0.915127 -2.46898
H  3.502818 -0.345302 -1.193909
H  -6.116473 1.016083 -1.057392
H  -5.967361 0.065016 -2.566976
H  -3.848282 1.557414 -1.848688
H  6.292079 1.154935 0.726891
H  4.754484 0.26522 1.079916
H  1.47867 -0.638663 -2.190806
H  0.193679 2.512112 0.580395
H  -7.858841 0.573414 0.091741
H  -6.014451 0.33213 2.573588
H  -7.253568 1.602795 2.305819
H  -8.170918 -1.496771 1.948026
H  -4.714986 1.411823 0.992892
H  6.862849 -0.684064 2.424955
H  8.301069 -3.058285 2.75116
