program: Gaussian 09
title: 000212986
version: EM64L-G09RevD.01
frameworkgroup: C1[X(C5H9Cl3O2)]
method: RPBEPBE
basis: SDD
operation: Freq
keyword: #p
keyword: freq=noraman
keyword: PBEPBE/SDD
title: #p freq=noraman PBEPBE/SDD
converged: YES YES NO NO
title: Mulliken charges:
elementType: Cl Cl Cl O O C C C C C H H H H H H H H H
charge: 0.137968 0.043587 0.122398 -0.434928 -0.412889 0.268840 0.049116 -0.715571 -0.711639 -0.668194 0.237450 0.263055 0.235886 0.197830 0.243029 0.222851 0.236581 0.329975 0.354655
chargesum: 0.00000
title: Mulliken charges with hydrogens summed into heavy atoms:
elementType: Cl Cl Cl O O C C C C C
charge: 0.137968 0.043587 0.122398 -0.104954 -0.058234 0.268840 0.286567 -0.018799 -0.009178 -0.668194
polarizability: 9.55727379e+01 3.83994818e+00 9.15821574e+01 3.92409883e+00 -1.45918436e+00 8.83489215e+01
1716.lowfreq: -9.9969 -0.0014 -0.0013 -0.0007 9.9753 14.3622 24.0807 104.3455 150.9368
frequency: 23.7794 104.3441 150.9362 174.2278 204.0111 227.1423 241.1864 242.9129 263.8840 269.4202 294.0173 307.2135 328.9888 351.7268 377.6401 414.2305 423.0025 467.9697 511.9472 598.3477 647.4980 771.0495 783.6397 864.9347 932.5118 950.1557 990.9324 1005.2795 1030.1863 1102.9029 1170.5535 1194.0685 1224.4206 1292.9331 1329.9002 1365.2741 1378.7394 1400.8335 1456.6076 1460.0470 1476.9064 1485.0231 2937.0586 2977.8440 3008.7467 3075.2654 3106.8986 3120.7857 3125.5801 3507.1584 3537.3766
redmass: 4.5264 5.7275 9.2427 16.2674 12.0788 2.2705 3.7604 1.1585 3.0242 9.4958 1.9852 1.1027 4.8542 3.1267 5.9776 1.4136 1.8887 4.3371 3.6019 6.6615 5.9917 4.8932 6.6798 2.7886 1.7153 1.9270 2.4719 1.9978 4.9872 1.5732 1.8898 1.9834 1.3593 1.2364 1.5676 1.4212 1.2759 1.2780 1.0478 1.0613 1.0609 1.0526 1.0823 1.0408 1.0358 1.0945 1.0996 1.0998 1.1001 1.0654 1.0659
irintensity: 0.7126 0.5872 0.2370 0.5635 0.6736 4.6999 7.2194 1.4504 1.2074 1.7432 58.4796 98.1057 4.9473 8.7018 3.9379 69.5044 97.8186 35.2580 12.3853 86.8000 64.9800 19.6028 132.1818 9.7814 14.2652 28.7584 45.5619 33.3143 5.2086 89.1309 47.1092 74.6916 1.5352 23.3135 64.3934 4.1273 32.5568 20.5290 5.3942 5.9137 9.3573 15.6584 22.0733 26.3380 11.7241 26.7722 25.4998 5.1111 15.8471 10.7653 5.6879
temp: 298.150 k
press: 1.00000 atm
elementType: 17 17 17 8 8 6 6 6 6 6 1 1 1 1 1 1 1 1 1
symmnumber: 1
zpe: 357013.8 jmol-1
zpe.correction: 0.135979 hartree
zpe.thermalcorrener: 0.148504 hartree
zpe.thermalcorrenthalpy: 0.149448 hartree
zpe.thermalcorrgfe: 0.097067 hartree
zpe.sumelectzpe: -1725.710225 hartree
zpe.sumelectthermal: -1725.697700 hartree
zpe.sumelectthermalent: -1725.696756 hartree
zpe.sumelectthermalfe: -1725.749138 hartree
dipole: 1.3407 -1.2944 -1.9581
dipole: 2.7032
quadrupole: -81.6024 -83.3988 -76.3243
quadrupole: 0.1130 -2.5279 -0.0026
quadrupole: -1.1605 -2.9570 4.1175 0.1130 -2.5279 -0.0026
hfenergy: -1725.8462046 hartree
pointgroup: C01 [X(C5H9Cl3O2)]
dipole: 0.5386412 -0.5433635 -0.7386895 debye
dipolederiv: -0.0904466 0.1329558 -0.0240956 0.0256887 -0.7295073 0.1636606 0.0069619 0.1920984 -0.1755485 -0.6740544 -0.2400535 -0.2193178 -0.2721318 -0.4350414 -0.1850522 -0.2667042 -0.1881263 -0.3484232 -0.155788 -0.0051334 0.116109 -0.0067178 -0.1230236 0.0829702 0.0537029 0.0395382 -0.7505008 -0.6740889 -0.072045 0.0232406 -0.1075773 -0.6327732 0.2213679 -0.0115434 0.2274316 -0.2537197 -0.4073144 0.0903465 0.1440406 0.1086141 -0.8039976 0.0438904 0.1572439 0.0112824 -0.3646114 0.6306457 0.0143988 -0.032285 0.33198 0.520549 -0.1357821 0.0505539 -0.1149766 0.411439 0.0450371 -0.1686144 -0.0869131 -0.1034888 0.3683829 -0.0320098 -0.081136 -0.0606439 0.0279766 -0.1655391 0.1092657 0.0516945 -0.0211792 -0.0940893 0.0169217 0.0181124 -0.043061 0.0272611 -0.0333711 -0.0005369 -0.0125962 -0.0144922 -0.0118927 -0.0589317 -0.0099616 0.0028891 -0.1391683 0.8713885 0.2906436 0.1669999 0.1563869 1.1917406 -0.0673451 0.1736038 -0.0582337 1.3051187 0.0096109 0.0111314 0.0306201 0.0108891 -0.0127452 0.0043552 -0.0002181 0.0442816 -0.1510532 0.1315036 0.0012838 0.0064048 0.0279645 -0.0382398 0.0635918 -0.0113287 0.0848295 0.0624016 -0.1251574 -0.0606425 -0.0111375 -0.0901335 0.0495605 -0.0225477 -0.0269342 -0.0327069 0.0862477 0.079641 0.0147456 -0.0697047 0.0093282 0.0712363 -0.0112217 -0.0114786 -0.0479482 -0.1755467 0.0448095 0.108747 0.0615899 0.1003154 -0.0033072 -0.0478281 0.0416861 -0.0323347 0.0435342 -0.1543579 -0.0601957 -0.0741172 -0.0569554 0.0970134 -0.0179545 -0.0234111 -0.0060278 0.0842271 0.11483 -0.0388203 0.0427598 -0.0313477 -0.0354682 0.0836458 0.0322648 0.0548853 0.0456989 0.3859711 0.0214054 -0.0220662 0.02804 0.2611606 -0.1286059 0.0204385 -0.0669703 -0.0080832 0.1666803 -0.1488818 -0.0912261 -0.0951832 0.3604423 0.0268752 -0.1118522 -0.0062067 0.2727501 unknown
polarizability: 95.4164206|4.1267238|91.5407053|3.747239|-1.5594621|88.5466909 unknown
InChI: InChI=1S/C5H9Cl3O2/c1-4(2,10)3(9)5(6,7)8/h3,9-10H,1-2H3
charge 0 multiplicity 1
19 atoms
Cl -1.51888 1.890249 -0.482432
Cl -2.703494 -0.865331 -0.89432
Cl -1.643425 -0.067463 1.820874
O  1.514724 1.490878 -0.644749
O  0.081684 -1.889294 -0.018902
C  1.405856 0.142761 -0.050735
C  0.026933 -0.505512 -0.465893
C  2.519907 -0.762512 -0.62752
C  1.584312 0.356335 1.456892
C  -1.313378 0.129697 0.010508
H  -0.031564 -0.445984 -1.578057
H  2.530185 -1.746309 -0.134416
H  3.492488 -0.263748 -0.472199
H  2.38066 -0.932057 -1.713798
H  0.936459 1.172085 1.814672
H  2.632161 0.639832 1.654089
H  1.346983 -0.565174 2.0124
H  1.649114 1.408088 -1.624502
H  -0.744923 -2.358841 -0.310214
