program: Gaussian 09
title: 000212992
version: EM64L-G09RevD.01
frameworkgroup: C1[X(C12H24N2O4)]
method: RPBEPBE
basis: SDD
operation: Freq
keyword: #p
keyword: freq=noraman
keyword: PBEPBE/SDD
title: #p freq=noraman PBEPBE/SDD
converged: YES YES NO NO
title: Mulliken charges:
elementType: O O O O N N C C C C C C C C C C C C H H H H H H H H H H H H H H H H H H H H H H H H
charge: -0.313537 -0.313041 -0.295468 -0.295098 -0.606548 -0.606391 0.405500 -0.479630 -0.424681 -0.405151 -0.391832 -0.408808 -0.013285 -0.735453 -0.721388 -0.720758 0.319632 0.317248 0.215944 0.208767 0.221246 0.203948 0.199901 0.203523 0.213499 0.262910 0.264759 0.219473 0.193680 0.223351 0.217520 0.228264 0.202576 0.212037 0.224217 0.205277 0.213262 0.213984 0.337951 0.332249 0.337923 0.332428
chargesum: 0.00000
title: Mulliken charges with hydrogens summed into heavy atoms:
elementType: O O O O N N C C C C C C C C C C C C
charge: -0.313537 -0.313041 -0.295468 -0.295098 0.063652 0.063960 0.405500 -0.054918 0.000512 -0.001727 0.084577 0.075424 0.180395 -0.066319 -0.082558 -0.088235 0.319632 0.317248
polarizability: 1.89342989e+02 -4.42093603e+00 1.49610379e+02 3.30898509e+00 1.28905445e+01 1.32472080e+02
1716.lowfreq: -19.5991 -9.0362 -4.0767 -0.0008 -0.0007 -0.0006 5.2778 28.0371 37.3181
frequency: -5.7232 27.9055 37.2340 42.8834 50.1030 59.0628 66.8744 77.7025 102.5823 114.3095 133.0169 162.7914 189.1319 194.6070 197.9974 224.4688 238.3431 241.7366 262.2191 271.8331 307.1635 323.0452 341.7488 375.0276 405.4294 437.9477 478.5104 482.0208 493.8087 495.3056 501.1856 507.0952 522.3933 557.7294 611.8318 615.5598 695.9126 703.8373 742.7860 756.2175 783.7862 808.0153 816.6752 826.6090 880.6574 900.0442 911.5001 937.6581 945.9942 962.5789 992.3281 996.4080 1010.3797 1033.3554 1056.9822 1060.0790 1061.6508 1062.2083 1091.0489 1121.0781 1167.8997 1172.3236 1176.7343 1215.2706 1219.7841 1241.9051 1255.5402 1271.3910 1287.5795 1296.5566 1310.6025 1313.3260 1329.9788 1331.2453 1355.0437 1358.4697 1363.1162 1373.1129 1375.7326 1388.9180 1392.0106 1452.2705 1463.2326 1466.3489 1468.2157 1472.0789 1474.3415 1480.1494 1481.6694 1483.2705 1487.5716 1490.6506 1589.9161 1590.8275 1685.6980 1693.1881 2953.9719 2960.1939 2964.6459 2969.4516 2972.4119 2979.6726 2981.6904 3006.4260 3013.5100 3015.3203 3030.2817 3033.8446 3056.2165 3063.9698 3066.8068 3072.2318 3073.4517 3076.2594 3081.2321 3081.8774 3558.9482 3559.5428 3715.7305 3715.9797
redmass: 2.4943 5.9055 4.6701 4.8212 7.0870 4.8560 2.8980 3.8496 2.8942 2.0463 2.2730 5.1294 1.8899 3.2698 1.2341 1.5001 2.1660 2.0095 3.3606 2.2902 2.7333 3.2418 2.0510 2.2258 2.2827 2.4520 1.9961 1.9003 1.4378 1.2468 1.1839 1.1798 2.6178 2.7053 5.3776 5.4407 11.1908 11.1976 1.3129 2.8633 1.3004 4.1775 3.0422 3.4206 2.2440 2.0056 1.1897 1.7416 1.4105 1.7146 2.7683 6.8913 2.4809 1.5138 2.7063 2.6015 2.1045 2.1990 1.7078 2.2094 1.9393 2.1141 1.8626 2.0850 1.7059 1.1879 1.2331 1.3356 1.8590 1.2552 1.4996 2.0750 1.4168 1.4701 1.5131 1.5627 1.4574 1.6010 1.2503 1.2203 1.2203 1.0722 1.0786 1.0590 1.0544 1.0709 1.0666 1.0624 1.0539 1.0768 1.0501 1.0586 1.2044 1.2181 7.1174 7.2612 1.0749 1.0639 1.0360 1.0385 1.0580 1.0583 1.0396 1.0973 1.0572 1.0593 1.0992 1.1031 1.0990 1.0989 1.0992 1.0988 1.0986 1.1010 1.1053 1.1057 1.0446 1.0447 1.1053 1.1053
irintensity: 0.0103 6.2668 3.6944 4.1947 2.1650 0.7321 5.3370 13.1461 0.5460 0.5745 1.8276 0.5377 1.0269 8.6921 1.1407 1.4400 3.8353 2.1305 14.8025 3.8464 1.7858 1.3048 14.4490 0.4259 1.4289 3.4089 28.0812 36.6300 271.7485 64.3310 124.7888 126.1603 6.4559 2.3589 2.5843 3.0358 80.8518 0.0851 15.4636 5.4786 12.1768 4.9158 28.7193 37.0464 7.0022 1.1871 4.8700 10.2469 3.9651 3.8038 153.1003 66.4208 109.0442 4.5056 71.1716 13.7090 22.5934 0.9262 8.6623 7.8225 3.8830 1.2625 8.4002 10.1408 3.9543 4.1223 2.9278 1.3332 39.9030 98.1188 63.4363 478.3851 2.2776 1.6328 1.5917 13.0256 17.3379 145.7620 30.9740 16.3578 14.9133 0.9223 0.5527 1.9754 4.1694 8.6949 2.3533 8.4197 11.8565 46.3606 18.3017 9.6517 43.3165 171.0617 10.0990 635.7401 5.3077 13.9360 35.1808 29.8288 31.7300 41.9426 23.6747 5.8277 41.4606 33.6201 14.3208 58.5484 8.3635 81.2971 59.8089 62.4225 45.0719 31.8934 34.4906 14.7541 80.8213 41.0538 19.4453 74.6890
temp: 298.150 k
press: 1.00000 atm
elementType: 8 8 8 8 7 7 6 6 6 6 6 6 6 6 6 6 6 6 1 1 1 1 1 1 1 1 1 1 1 1 1 1 1 1 1 1 1 1 1 1 1 1
symmnumber: 1
zpe: 940791.4 jmol-1
zpe.correction: 0.358329 hartree
zpe.thermalcorrener: 0.379686 hartree
zpe.thermalcorrenthalpy: 0.380630 hartree
zpe.thermalcorrgfe: 0.307112 hartree
zpe.sumelectzpe: -880.650736 hartree
zpe.sumelectthermal: -880.629379 hartree
zpe.sumelectthermalent: -880.628435 hartree
zpe.sumelectthermalfe: -880.701952 hartree
dipole: 1.0668 -0.3431 -0.1524
dipole: 1.1310
quadrupole: -103.4849 -100.6818 -114.7186
quadrupole: 2.4620 2.3527 9.1434
quadrupole: 2.8102 5.6133 -8.4235 2.4620 2.3527 9.1434
hfenergy: -881.0090646 hartree
pointgroup: C01 [X(C12H24N2O4)]
dipole: -0.3846759 -0.2026523 0.0945359 debye
polarizability: 185.0378196|14.5358712|146.3894717|5.1312479|-14.7072574|139.9981566 unknown
InChI: InChI=1S/C12H24N2O4/c1-4-12(6-5-9(2)3,7-17-10(13)15)8-18-11(14)16/h9H,4-8,13-14H2,1-3H3
charge 0 multiplicity 1
42 atoms
O  0.298987 1.746962 -0.183234
O  2.287389 -1.058055 0.207164
O  2.313692 2.568984 0.750407
O  3.287497 0.135578 -1.576663
N  1.45322 3.365812 -1.281864
N  4.465055 -0.435532 0.371106
C  -0.152702 -0.62508 0.418266
C  -1.455619 -0.641779 -0.445701
C  -0.248309 -1.545146 1.678113
C  -2.770537 -0.347192 0.311737
C  0.152956 0.797509 0.947331
C  0.993095 -1.078755 -0.517854
C  -4.013244 -0.219645 -0.612275
C  -0.599544 -3.023993 1.404395
C  -4.327934 -1.537614 -1.361238
C  -5.243472 0.241403 0.205463
C  1.450068 2.567206 -0.16221
C  3.353871 -0.391453 -0.438059
H  -1.336098 0.108381 -1.253162
H  -1.53409 -1.629157 -0.942187
H  0.724598 -1.501747 2.204878
H  -1.001242 -1.11926 2.371148
H  -2.969919 -1.141739 1.060383
H  -2.667365 0.600408 0.877956
H  -0.675398 1.172917 1.573769
H  1.08745 0.809268 1.535412
H  1.07403 -0.415704 -1.397085
H  0.834932 -2.117694 -0.857158
H  -3.790215 0.56184 -1.370547
H  -1.575998 -3.132267 0.898228
H  -0.654828 -3.583766 2.355976
H  0.165637 -3.517709 0.778708
H  -4.513238 -2.359091 -0.641237
H  -5.233819 -1.427975 -1.986201
H  -3.50033 -1.845999 -2.02497
H  -5.501856 -0.509053 0.977913
H  -6.12913 0.374818 -0.443414
H  -5.049482 1.201998 0.718728
H  2.261945 3.957131 -1.449568
H  0.750438 3.235794 -2.005272
H  5.295487 0.070784 0.078175
H  4.39772 -0.816082 1.311741
