program: Gaussian 09
title: 000213011
version: EM64L-G09RevD.01
frameworkgroup: C1[X(C19H22F4O3)]
method: RPBEPBE
basis: SDD
operation: Freq
keyword: #p
keyword: freq=noraman
keyword: PBEPBE/SDD
title: #p freq=noraman PBEPBE/SDD
converged: YES YES NO NO
title: Mulliken charges:
elementType: F F F F O O O C C C C C C C C C C C C C C C C C C C H H H H H H H H H H H H H H H H H H H H H H
charge: -0.162325 -0.155744 -0.160155 -0.159818 -0.281182 -0.266285 -0.267641 0.311406 -0.270835 -0.393098 -0.735676 -0.743532 -0.263694 0.296202 0.359953 -0.793891 -0.790873 -0.424988 0.271589 -0.002244 0.076284 0.092047 0.081399 0.226807 -0.377440 -0.494306 0.259477 0.268333 0.221409 0.212641 0.226230 0.258822 0.211557 0.216139 0.197189 0.221879 0.220570 0.236255 0.217488 0.218718 0.227998 0.256693 0.266847 0.217670 0.217636 0.206645 0.240967 0.206877
chargesum: 0.00000
title: Mulliken charges with hydrogens summed into heavy atoms:
elementType: F F F F O O O C C C C C C C C C C C C C C C C C C C
charge: -0.162325 -0.155744 -0.160155 -0.159818 -0.281182 -0.266285 -0.267641 0.311406 -0.011358 -0.124765 -0.075395 -0.057014 -0.066505 0.296202 0.359953 -0.115188 -0.126670 0.098552 0.271589 -0.002244 0.076284 0.092047 0.081399 0.226807 0.057866 0.160183
polarizability: 3.26988665e+02 1.83789937e+01 2.11243466e+02 -9.43503690e+00 3.53980778e+00 1.68943189e+02
1716.lowfreq: -8.0696 -7.0049 -2.8700 -0.0004 0.0005 0.0008 5.5468 9.9818 14.5392
frequency: 4.2407 9.1242 14.2712 19.0165 21.7445 45.0385 56.5260 76.9208 80.3517 95.9099 109.1500 119.6231 125.1429 129.6486 145.6990 165.9433 173.8837 182.8972 192.3910 200.0384 210.2062 230.5369 239.3506 249.1791 266.5972 274.4438 277.1137 283.1985 285.6910 295.2772 326.3413 335.9722 344.9598 369.3038 393.1018 405.1587 414.8466 430.8978 448.6351 465.1902 474.1158 502.1496 513.4465 560.5108 609.9027 619.2893 638.7871 663.6935 672.7463 714.2990 724.1384 740.4455 805.7884 819.0794 834.8670 858.6205 875.9916 878.4967 882.8755 921.2457 948.0016 952.2108 964.4954 973.1665 990.6711 1004.3424 1015.1672 1034.9694 1038.1842 1039.8691 1051.4251 1063.2248 1075.6957 1082.2670 1095.2701 1107.8438 1112.6880 1123.9517 1149.5242 1164.7385 1195.8432 1207.2323 1229.2843 1235.0319 1242.9981 1286.6758 1323.9570 1345.9940 1368.3347 1369.9650 1372.5658 1384.7673 1387.6859 1390.0473 1399.6873 1401.0454 1418.4413 1434.7268 1445.7838 1454.6576 1457.6416 1458.8574 1461.8601 1466.0140 1467.6100 1470.3383 1471.4865 1475.4659 1475.9682 1479.7577 1483.1404 1488.7811 1594.3787 1630.4431 1638.4439 1685.5469 2931.0688 2956.8198 2957.6595 2965.6258 2975.7759 2979.0384 3006.2591 3010.8671 3019.0026 3027.8270 3033.1029 3060.7592 3068.0910 3077.5119 3081.3507 3092.0624 3097.0204 3097.5094 3106.7095 3113.2526 3120.9983 3154.0110
redmass: 4.5399 3.3780 5.0601 4.6267 5.1535 4.5573 5.2994 2.4661 3.6856 4.5161 1.1918 15.1296 3.8211 3.8242 2.6849 3.1856 1.4860 1.4219 2.7632 3.4522 1.3018 1.6681 4.6943 3.0979 5.5958 2.7031 2.7078 5.7422 8.2509 5.4381 3.3802 2.9809 4.6792 2.6257 12.3645 4.3690 2.4830 11.9937 2.8540 10.6197 4.4820 2.8169 3.6120 6.0070 7.6682 4.2067 12.1163 4.9138 6.8592 6.4565 5.5406 9.7623 3.8280 3.4186 4.0478 1.6620 5.7786 5.7464 3.3402 5.8665 1.4406 1.6905 1.9189 1.6157 1.2532 1.5756 2.1625 1.8022 7.4963 2.2804 1.7749 4.5628 1.4265 1.5430 5.6151 2.2665 1.2998 1.8033 1.4144 2.6199 2.0585 1.1319 1.3557 3.3737 2.4095 1.7920 1.6582 1.4786 2.2508 3.8552 1.2900 6.2122 1.2401 1.2905 1.2241 1.2856 2.1526 1.1496 6.8597 1.0496 1.0605 5.7818 1.0525 1.0520 1.0902 1.0528 1.0457 1.1001 1.1640 1.0788 1.1359 1.0644 9.1585 9.7185 11.8159 6.3360 1.0343 1.0373 1.0546 1.0390 1.0367 1.0365 1.1040 1.1065 1.0617 1.0969 1.0963 1.0992 1.0988 1.0982 1.0981 1.0893 1.0966 1.0980 1.1019 1.0976 1.0877 1.0891
irintensity: 0.1022 0.2621 0.2622 0.2316 0.3034 0.5682 1.0902 8.9287 1.6651 0.8534 0.3861 0.1226 0.5811 0.3360 1.5144 0.3543 0.9327 0.1340 3.2518 1.4336 1.0863 1.2709 1.4697 3.3002 3.7685 0.9256 2.3118 3.2031 0.6317 7.5530 8.2414 0.2574 19.5269 2.7798 0.4319 1.1220 1.0317 0.1657 2.9286 0.3340 4.5509 7.0029 10.8411 4.7573 35.1207 8.4056 0.3849 0.2436 12.9670 5.3032 11.7861 9.8994 43.4033 5.6454 53.5547 10.8350 42.6552 33.8774 55.5526 8.3750 5.4157 20.3749 30.0891 100.3128 2.4691 17.1429 33.6554 72.5454 118.4383 46.2378 34.9241 0.1563 3.4792 6.0483 22.3083 420.5245 1.7259 16.0273 5.4541 51.4680 41.0834 19.0881 32.5292 79.9064 42.1905 49.4584 16.0787 6.2958 75.1489 26.0589 35.9591 26.2437 2.7727 50.5970 12.7080 22.4452 75.5939 0.7934 237.6179 1.2604 5.8373 0.0308 14.5046 7.0511 8.3400 8.4692 23.6051 6.4898 14.1323 4.7210 19.6573 13.0451 0.7471 157.3901 6.2708 9.0569 91.9231 50.7612 55.2379 62.4183 21.2127 45.1219 80.2524 3.3540 41.4296 11.4727 39.7091 14.8266 47.6606 21.3627 27.1830 27.7371 24.7446 15.5262 10.6487 22.4225 11.8839 3.3070
temp: 298.150 k
press: 1.00000 atm
elementType: 9 9 9 9 8 8 8 6 6 6 6 6 6 6 6 6 6 6 6 6 6 6 6 6 6 6 1 1 1 1 1 1 1 1 1 1 1 1 1 1 1 1 1 1 1 1 1 1
symmnumber: 1
zpe: 968045.3 jmol-1
zpe.correction: 0.368709 hartree
zpe.thermalcorrener: 0.397625 hartree
zpe.thermalcorrenthalpy: 0.398569 hartree
zpe.thermalcorrgfe: 0.302805 hartree
zpe.sumelectzpe: -1360.221799 hartree
zpe.sumelectthermal: -1360.192883 hartree
zpe.sumelectthermalent: -1360.191938 hartree
zpe.sumelectthermalfe: -1360.287702 hartree
dipole: -0.7694 -1.0956 0.6652
dipole: 1.4949
quadrupole: -113.4277 -154.2601 -154.9925
quadrupole: 7.8658 7.5329 -6.1121
quadrupole: 27.4657 -13.3667 -14.0991 7.8658 7.5329 -6.1121
hfenergy: -1360.5905077 hartree
pointgroup: C01[X(C19H22F4O3)]
dipole: -0.3167411 -0.3852023 0.3117633 debye
polarizability: 327.9587072|11.4051935|210.0762397|-14.273906|-0.6377671|169.1403723 unknown
InChI: InChI=1S/C19H22F4O3/c1-9(2)6-12-13(19(12,3)4)18(24)26-8-11-16(22)14(20)10(7-25-5)15(21)17(11)23/h6,12-13H,7-8H2,1-5H3
charge 0 multiplicity 1
48 atoms
F  -2.19646 3.307854 0.024596
F  -0.998047 -1.154693 -1.427247
F  -3.530273 -2.044594 -0.780281
F  -4.728847 2.421727 0.65699
O  0.81817 0.892371 -0.124085
O  2.089883 0.23081 -1.980627
O  -5.465885 -0.764412 1.769666
C  3.272306 -1.899081 0.109111
C  4.242851 -0.715555 -0.022715
C  2.728003 -0.443445 0.291675
C  3.283703 -2.75564 1.375187
C  2.920213 -2.6810 -1.15488
C  5.28178 -0.379047 0.983979
C  1.904644 0.218429 -0.73871
C  6.464375 0.26726 0.753878
C  6.926063 0.774254 -0.600759
C  7.437102 0.527687 1.892409
C  -0.139414 1.566225 -1.044675
C  -1.533086 1.093833 -0.708461
C  -2.512142 1.960594 -0.181647
C  -1.919969 -0.250548 -0.896236
C  -3.209247 -0.702062 -0.565944
C  -3.804384 1.508621 0.144862
C  -4.187479 0.164419 -0.034452
C  -5.555788 -0.332881 0.364227
C  -6.752304 -1.271219 2.256114
H  4.486703 -0.47499 -1.063951
H  2.472751 -0.16112 1.316491
H  4.088977 -3.512257 1.318424
H  3.440691 -2.162206 2.292476
H  2.321066 -3.288703 1.481965
H  2.896482 -2.035104 -2.047884
H  3.669005 -3.478772 -1.318754
H  1.927793 -3.159878 -1.054822
H  5.069446 -0.688339 2.017939
H  7.12276 1.863981 -0.558615
H  7.881377 0.293325 -0.891288
H  6.198036 0.596513 -1.408002
H  8.41898 0.053235 1.693089
H  7.629905 1.612969 2.009497
H  7.059656 0.141131 2.855049
H  -0.044868 2.649656 -0.876447
H  0.145823 1.31577 -2.08328
H  -5.855467 -1.186309 -0.278456
H  -6.303763 0.480285 0.261565
H  -7.088571 -2.15362 1.671522
H  -6.582969 -1.567311 3.302554
H  -7.539076 -0.488459 2.215555
