program: Gaussian 09
title: 000213002
version: EM64L-G09RevD.01
frameworkgroup: C1[X(C12H24N2O4)]
method: RPBEPBE
basis: SDD
operation: Freq
keyword: #p
keyword: freq=noraman
keyword: PBEPBE/SDD
title: #p freq=noraman PBEPBE/SDD
converged: YES YES NO NO
title: Mulliken charges:
elementType: O O O O N N C C C C C C C C C C C C H H H H H H H H H H H H H H H H H H H H H H H H
charge: -0.290720 -0.307248 -0.284732 -0.287674 -0.619772 -0.616914 -0.052606 -0.402968 -0.398284 -0.383515 -0.373678 -0.349616 -0.378072 -0.355327 -0.356884 -0.697696 0.295058 0.307103 0.242258 0.201814 0.212950 0.236587 0.185112 0.184767 0.196391 0.186495 0.198231 0.236577 0.234429 0.259749 0.229239 0.185306 0.188533 0.194203 0.196881 0.208547 0.214314 0.209572 0.335931 0.339552 0.335760 0.340348
chargesum: 0.00000
title: Mulliken charges with hydrogens summed into heavy atoms:
elementType: O O O O N N C C C C C C C C C C C C
charge: -0.290720 -0.307248 -0.284732 -0.287674 0.055711 0.059193 0.189652 0.011796 0.023415 -0.002357 0.011048 0.121390 0.110917 0.018512 0.034200 -0.065263 0.295058 0.307103
polarizability: 1.72738672e+02 -6.73401978e+00 1.65772018e+02 1.66532338e+00 -5.47916663e+00 1.33303338e+02
1716.lowfreq: -7.0182 -4.2432 -0.0007 -0.0005 -0.0001 6.5138 18.7766 28.1916 32.9303
frequency: 18.5661 28.1827 32.8831 41.2320 51.3758 55.6602 58.0835 66.5315 80.2916 103.0197 106.7408 136.0049 148.6161 155.1377 167.8075 214.6357 225.1241 229.7466 274.3703 295.7061 310.8297 363.8053 406.3793 427.9470 454.4616 476.7835 492.6080 493.4398 503.0586 517.0410 521.4409 583.0457 606.7016 639.2429 698.1809 705.8175 723.6350 733.3536 760.8588 768.7493 792.9084 816.7948 858.8794 888.0650 902.0485 930.7216 947.9904 984.4084 1000.8466 1013.2088 1017.0360 1024.8656 1051.6738 1056.7854 1057.2936 1078.4511 1078.8265 1096.2244 1106.3111 1140.3655 1151.8386 1190.0050 1217.8964 1230.0460 1242.5981 1252.4026 1266.4806 1276.2523 1284.1055 1292.1279 1297.0373 1299.6765 1307.2073 1308.5709 1319.2139 1336.1413 1350.9243 1356.7060 1364.9601 1369.9651 1385.0932 1389.8659 1447.6001 1462.2667 1462.5962 1465.9118 1467.9923 1471.5131 1476.3496 1478.3421 1484.9236 1489.1980 1586.1473 1587.2789 1683.4815 1684.7781 2949.3271 2950.5526 2955.4379 2959.8875 2967.8791 2970.2594 2970.9919 2981.8356 2985.9152 2994.9553 3010.4525 3018.7267 3021.1750 3025.8275 3033.5872 3046.7909 3067.4515 3069.2854 3094.0482 3108.1992 3558.1788 3558.8024 3716.7653 3717.1448
redmass: 5.3372 4.9817 6.6446 4.7611 2.4788 2.8214 3.0420 4.5208 4.8717 3.7243 1.6475 3.1774 2.1961 2.5002 5.4679 5.8045 1.1528 3.0664 3.8898 2.5414 4.1520 2.2044 2.7012 3.1909 3.2680 2.8190 1.1937 1.1978 2.6663 1.0553 1.0832 3.4637 5.1293 4.4327 11.1554 11.4130 1.0631 1.0984 1.2128 3.9323 2.8990 1.5338 1.9670 1.8757 1.5057 1.8048 1.8710 2.1358 4.1594 1.7045 6.7022 2.9880 2.9656 1.9573 2.0402 2.1620 2.4752 1.6127 2.2248 3.0272 1.9554 1.6982 1.2778 1.3592 1.2715 1.1219 1.2652 1.2504 1.0447 1.1700 2.3404 1.1699 1.2845 1.8163 1.6773 1.4106 1.5607 1.6750 1.5759 1.4734 1.4448 1.2192 1.1005 1.0718 1.0744 1.0944 1.0680 1.0748 1.0443 1.0764 1.0880 1.0945 1.2155 1.2172 6.9293 6.9903 1.0589 1.0590 1.0611 1.0615 1.0587 1.0640 1.0372 1.0784 1.0949 1.0980 1.0989 1.0976 1.0632 1.0605 1.1040 1.1036 1.1006 1.0993 1.1076 1.1047 1.0445 1.0445 1.1058 1.1058
irintensity: 0.1531 1.2010 3.0076 2.7109 2.5228 3.1295 0.4454 3.5355 7.3667 1.3834 0.1105 0.3477 0.1932 1.5428 9.5357 4.3128 0.0185 0.8815 19.3427 3.6724 6.9556 8.1837 3.7628 9.1966 0.7433 9.2258 252.9926 342.2767 18.8731 8.0068 28.7924 6.6091 3.1398 5.6171 36.3031 33.9489 13.3462 1.6469 7.0621 7.9284 25.6158 4.0718 3.5990 5.4533 8.1770 5.0243 22.4829 127.4408 0.3472 78.1711 109.1461 40.9118 1.9544 3.7651 22.9572 1.0947 0.2597 15.0082 22.6065 3.1612 2.8968 1.0850 24.5300 1.5769 26.4169 2.7374 6.0133 0.5612 0.9659 2.5238 639.0295 12.9051 0.4035 6.5954 46.5431 1.8574 10.5158 3.9587 0.0675 93.3130 2.7585 11.3243 24.5095 0.4104 0.7538 24.6436 1.7473 4.2709 12.0036 1.9404 2.2013 29.3043 169.6415 21.8594 360.5116 354.1682 1.5360 2.5411 4.2726 24.3050 74.3083 80.1203 35.6104 18.8424 8.5948 3.6875 3.2281 2.3246 33.8031 41.3850 22.8817 129.8947 98.5864 57.0491 10.2268 14.1231 72.8121 56.9178 51.4042 47.2020
temp: 298.150 k
press: 1.00000 atm
elementType: 8 8 8 8 7 7 6 6 6 6 6 6 6 6 6 6 6 6 1 1 1 1 1 1 1 1 1 1 1 1 1 1 1 1 1 1 1 1 1 1 1 1
symmnumber: 1
zpe: 945000.6 jmol-1
zpe.correction: 0.359932 hartree
zpe.thermalcorrener: 0.381940 hartree
zpe.thermalcorrenthalpy: 0.382884 hartree
zpe.thermalcorrgfe: 0.304884 hartree
zpe.sumelectzpe: -880.651520 hartree
zpe.sumelectthermal: -880.629512 hartree
zpe.sumelectthermalent: -880.628568 hartree
zpe.sumelectthermalfe: -880.706567 hartree
dipole: 0.9916 -0.3462 -3.4431
dipole: 3.5997
quadrupole: -117.7533 -85.4820 -109.9253
quadrupole: 1.9208 -8.7535 -4.2207
quadrupole: -13.3664 18.9049 -5.5384 1.9208 -8.7535 -4.2207
hfenergy: -881.0114517 hartree
pointgroup: C01 [X(C12H24N2O4)]
dipole: 0.3872584 -0.6725054 -1.1846996 debye
polarizability: 172.5258253|-5.6482348|156.7201036|4.1665456|-15.7247314|142.5680984 unknown
InChI: InChI=1S/C12H24N2O4/c1-2-3-4-5-6-7-10(8-17-11(13)15)9-18-12(14)16/h10H,2-9,13-14H2,1H3
charge 0 multiplicity 1
42 atoms
O  2.805044 -1.869813 -0.200719
O  1.756397 2.30068 -0.939316
O  3.74071 -1.660717 1.959472
O  -0.414714 3.233642 -0.801771
N  3.292777 -3.748379 0.980277
N  0.947732 3.490851 -2.694417
C  1.503096 0.19389 0.373526
C  0.199694 -0.303334 -0.300058
C  -1.090473 0.017902 0.487615
C  -2.35175 -0.597555 -0.160202
C  -3.64973 -0.269037 0.611118
C  2.762503 -0.387289 -0.303651
C  1.619431 1.729314 0.431322
C  -4.917718 -0.873229 -0.033065
C  -6.214318 -0.538349 0.739271
C  -7.478267 -1.142329 0.089762
C  3.319641 -2.370654 1.011201
C  0.655781 3.031916 -1.428275
H  1.512035 -0.141274 1.43231
H  0.126543 0.128844 -1.319393
H  0.281733 -1.400572 -0.431997
H  -1.226857 1.114782 0.552982
H  -0.991795 -0.362326 1.526605
H  -2.233249 -1.699756 -0.230142
H  -2.442922 -0.225773 -1.20224
H  -3.558801 -0.636529 1.655126
H  -3.76218 0.83306 0.678262
H  2.760256 -0.196082 -1.388325
H  3.680038 0.023995 0.155138
H  0.738584 2.186314 0.913179
H  2.538751 2.038359 0.9586
H  -4.807407 -1.976268 -0.100925
H  -5.009604 -0.505834 -1.076853
H  -6.12127 -0.905067 1.782165
H  -6.321787 0.563612 0.806785
H  -7.408698 -2.24562 0.038756
H  -8.390423 -0.887217 0.660428
H  -7.609774 -0.767697 -0.943158
H  2.944313 -4.239161 0.160531
H  3.64061 -4.260656 1.785462
H  1.850611 3.294056 -3.118921
H  0.252661 4.047899 -3.182566
