program: Gaussian 09
title: 000212948
version: EM64L-G09RevD.01
frameworkgroup: C1[X(C11H20NO)]
method: RPBEPBE
basis: SDD
operation: Freq
keyword: #p
keyword: freq=noraman
keyword: PBEPBE/SDD
title: #p freq=noraman PBEPBE/SDD
converged: YES YES NO NO
title: Mulliken charges:
elementType: O N C C C C C C C C C C C H H H H H H H H H H H H H H H H H H H H
charge: -0.280551 -0.129866 0.024971 -0.435325 -0.563289 -0.563673 -0.572546 -0.726165 -0.541374 0.375267 -0.419113 -0.238319 -0.173150 0.274564 0.221594 0.248893 0.279594 0.260997 0.266165 0.259314 0.291824 0.264826 0.272706 0.278823 0.263391 0.262601 0.253038 0.228816 0.237105 0.262736 0.273394 0.271944 0.270809
chargesum: 1.00000
title: Mulliken charges with hydrogens summed into heavy atoms:
elementType: O N C C C C C C C C C C C
charge: -0.280551 -0.129866 0.299535 0.035162 0.243468 0.252291 0.242374 0.018290 -0.041534 0.375267 -0.145719 0.033625 0.097659
polarizability: 1.31841848e+02 -7.25358774e+00 1.22491066e+02 1.12480990e+01 3.01234114e+00 1.04387028e+02
1716.lowfreq: -0.0007 -0.0003 -0.0001 10.8560 11.2183 21.0407 34.8246 50.3871 60.4950
frequency: 34.0079 50.3572 60.3866 95.9686 153.0297 187.7639 203.1006 239.4436 241.5638 261.5555 289.5312 316.2123 321.0186 355.2325 376.5900 399.2696 439.5216 450.1134 466.3563 541.1346 588.5218 605.7999 657.5544 694.2818 735.3029 800.7786 820.9972 840.2941 868.0531 876.7061 892.3339 904.3663 927.2663 939.4248 942.6530 1000.3074 1007.3239 1035.3654 1042.7336 1047.3587 1075.4619 1098.5396 1112.5811 1130.4521 1139.2519 1174.0979 1203.7978 1216.4576 1226.3162 1231.7393 1241.8510 1253.2045 1313.7929 1317.7881 1352.2409 1361.0469 1366.0957 1409.9428 1421.1236 1425.2595 1450.1457 1455.1377 1460.3253 1463.6709 1464.9995 1470.3804 1479.8154 1488.0353 1490.8153 1495.1534 1496.2120 1503.1135 1596.7507 2995.9155 3001.6491 3005.9688 3016.3621 3027.4618 3029.9868 3035.0857 3057.4082 3078.1412 3090.5359 3110.1869 3137.6229 3139.7659 3144.4899 3156.6350 3161.3142 3162.7391 3221.4581 3236.3572 3269.6469
redmass: 3.5874 3.4713 4.4190 2.7634 2.9549 1.1240 2.9819 1.4623 1.1381 1.6277 1.3499 2.1657 1.8432 2.4519 2.2500 2.4673 2.3876 2.6045 3.0334 2.5945 3.4406 3.7415 3.2592 2.7130 1.2598 2.5836 1.8277 1.5723 6.5624 4.1807 1.3832 1.6734 2.4349 2.3828 2.1770 2.0611 2.1929 1.5222 1.2505 1.8584 1.7369 1.4741 1.4825 1.4410 1.6805 1.6738 1.7744 2.0444 1.7870 1.5437 1.7242 1.4906 1.3965 1.3340 1.4988 2.0668 1.2935 1.1838 1.1397 1.1525 1.0526 1.1222 1.0785 1.0587 1.0606 1.0674 1.0530 1.0515 1.0600 1.4944 2.0587 1.0647 6.9305 1.0640 1.0455 1.0759 1.0628 1.0326 1.0330 1.0335 1.0986 1.1015 1.0975 1.1006 1.1053 1.1045 1.1043 1.1042 1.1045 1.1045 1.0946 1.0970 1.1094
irintensity: 0.9126 0.1980 4.0430 0.3407 1.6738 0.3987 7.2590 2.5035 1.5378 0.4101 0.1743 3.6202 0.4698 0.4934 0.1180 0.4147 1.6186 0.5197 0.6557 4.8401 5.2114 1.2160 2.7616 2.2993 85.0828 22.5902 6.8387 35.8846 4.7153 14.3179 1.3337 7.3351 15.0224 19.0595 3.9792 36.2327 3.3122 3.0954 0.2570 6.3767 7.9097 6.0546 1.8347 17.6469 29.4486 0.4791 1.9128 3.6020 3.9007 6.5903 1.0158 0.2415 4.3199 2.8985 3.0214 4.4645 4.4367 18.5068 14.5494 36.5847 2.7808 12.0657 14.9698 11.5980 4.7274 0.8385 26.8482 33.0946 60.9615 20.8940 13.7357 41.4051 5.2916 12.6784 6.8378 0.7271 20.7531 2.1653 4.0357 6.1371 6.4070 20.9222 10.4869 15.2859 0.3092 4.8099 9.5073 1.0993 2.1213 4.5573 1.6287 0.7289 0.2710
temp: 298.150 k
press: 1.00000 atm
elementType: 8 7 6 6 6 6 6 6 6 6 6 6 6 1 1 1 1 1 1 1 1 1 1 1 1 1 1 1 1 1 1 1 1
symmnumber: 1
zpe: 772631.5 jmol-1
zpe.correction: 0.294280 hartree
zpe.thermalcorrener: 0.308612 hartree
zpe.thermalcorrenthalpy: 0.309556 hartree
zpe.thermalcorrgfe: 0.253253 hartree
zpe.sumelectzpe: -559.832756 hartree
zpe.sumelectthermal: -559.818424 hartree
zpe.sumelectthermalent: -559.817480 hartree
zpe.sumelectthermalfe: -559.873782 hartree
dipole: -7.1742 -1.2978 0.9967
dipole: 7.3584
quadrupole: -46.8739 -63.0116 -71.5316
quadrupole: 2.9620 2.8960 0.2619
quadrupole: 13.5985 -2.5392 -11.0592 2.9620 2.8960 0.2619
hfenergy: -560.1270356 hartree
pointgroup: C01 [X(C11H20N1O1)]
dipole: -2.8268386 -0.1024742 0.616149 debye
polarizability: 131.5447062|-6.8709762|124.5625927|10.3841748|-0.2409794|102.6126436 unknown
InChI: InChI=1S/C11H20NO/c1-10(12(2,3)4)7-8-11-6-5-9-13-11/h5-6,9-10H,7-8H2,1-4H3
charge 1 multiplicity 1
33 atoms
O  1.634867 -0.983406 -0.897009
N  -2.318017 -0.365973 0.226827
C  -1.22564 0.787406 0.229315
C  -0.56716 0.961678 -1.163256
C  -3.325986 -0.184129 -0.903901
C  -1.614419 -1.718474 0.076313
C  -3.07121 -0.385936 1.5563
C  -1.790563 2.117668 0.755691
C  0.925181 1.388117 -1.037872
C  1.781709 0.337536 -0.393108
C  2.770078 0.343136 0.576448
C  3.280418 -1.011039 0.689577
C  2.576457 -1.785559 -0.211241
H  -0.466983 0.398914 0.937051
H  -0.5803 0.027598 -1.75144
H  -1.115935 1.723702 -1.74623
H  -2.819488 -0.295514 -1.871976
H  -4.107371 -0.953756 -0.805732
H  -3.781421 0.814021 -0.830855
H  -2.377049 -2.5017 -0.055865
H  -0.934307 -1.699664 -0.78547
H  -1.029099 -1.914407 0.987689
H  -2.344746 -0.383875 2.383108
H  -3.724958 0.493725 1.627283
H  -3.680348 -1.302319 1.59972
H  -0.989459 2.873752 0.681223
H  -2.092629 2.082711 1.814429
H  -2.633947 2.491982 0.148318
H  1.024955 2.325197 -0.460917
H  1.295335 1.611657 -2.057211
H  3.117417 1.212346 1.13243
H  4.075188 -1.354162 1.348544
H  2.60773 -2.831533 -0.503284
