program: Gaussian 09
title: 000212930
version: EM64L-G09RevD.01
frameworkgroup: C1[X(C8H8O2)]
method: RPBEPBE
basis: SDD
operation: Freq
keyword: #p
keyword: freq=noraman
keyword: PBEPBE/SDD
title: #p freq=noraman PBEPBE/SDD
converged: NO YES NO NO
title: Mulliken charges:
elementType: O O C C C C C C C C H H H H H H H H
charge: -0.238089 -0.245195 0.347427 -0.251542 -0.379249 -0.277509 -0.250401 -0.157646 0.192878 -0.781602 0.278517 0.265751 0.249921 0.259130 0.264919 0.234443 0.253801 0.234447
chargesum: 0.00000
title: Mulliken charges with hydrogens summed into heavy atoms:
elementType: O O C C C C C C C C
charge: -0.238089 -0.245195 0.347427 0.026975 -0.113499 -0.027588 0.008729 0.107273 0.192878 -0.058911
polarizability: 1.89269418e+02 3.16840655e+00 9.01280856e+01 3.70880732e-02 1.81707428e-02 4.29859733e+01
1716.lowfreq: -14.3557 -6.7754 -5.2673 -0.0006 -0.0004 0.0004 58.0737 81.6698 90.2538
frequency: 58.0148 81.6519 90.2507 94.8972 172.9693 224.2482 313.8239 332.8947 473.8937 556.8172 564.7227 585.5027 656.5375 733.8274 740.6646 816.6379 868.5978 871.4459 873.9107 888.9623 901.1083 955.1872 993.2252 1020.3528 1023.9602 1054.7997 1134.8145 1170.4068 1199.7901 1254.9818 1276.8656 1306.5145 1364.8818 1371.3818 1442.3693 1454.6151 1466.8501 1539.4479 1567.8676 1654.3775 2979.0216 3061.2412 3116.5706 3125.7446 3140.3258 3222.8900 3237.7405 3268.7170
redmass: 3.5446 1.2372 4.3699 3.4069 3.2031 7.7170 3.5478 2.9126 3.4428 2.6124 5.1399 2.9238 4.2295 4.9512 1.2661 1.3141 6.5581 1.6329 4.1970 1.4329 3.7386 1.7426 1.1223 1.5906 1.8248 2.4590 1.6139 1.6125 1.8635 2.4450 1.7682 2.0314 1.2675 2.5953 1.1014 1.0502 5.0382 5.6816 6.9537 6.6132 1.0375 1.0964 1.0906 1.0992 1.0912 1.0924 1.0982 1.1084
irintensity: 7.2075 0.0025 2.3497 0.0052 0.3526 3.5789 0.4235 4.6279 6.2590 0.0356 27.8212 9.9136 0.1316 6.3778 86.8001 29.0478 9.9937 0.7283 10.9984 0.3622 4.6348 58.9130 60.5680 21.1551 3.1486 26.1700 2.9129 24.3753 87.6253 36.7221 58.0919 72.7195 59.6627 37.5848 34.6365 19.9308 23.9696 162.7881 190.9586 140.8421 3.7356 15.4362 0.5871 19.0870 6.9889 3.5344 0.5940 0.0145
temp: 298.150 k
press: 1.00000 atm
elementType: 8 8 6 6 6 6 6 6 6 6 1 1 1 1 1 1 1 1
symmnumber: 1
zpe: 360711.9 jmol-1
zpe.correction: 0.137388 hartree
zpe.thermalcorrener: 0.147008 hartree
zpe.thermalcorrenthalpy: 0.147952 hartree
zpe.thermalcorrgfe: 0.101427 hartree
zpe.sumelectzpe: -459.335034 hartree
zpe.sumelectthermal: -459.325414 hartree
zpe.sumelectthermalent: -459.324470 hartree
zpe.sumelectthermalfe: -459.370994 hartree
dipole: 3.5140 -2.0493 0.0043
dipole: 4.0679
quadrupole: -52.0691 -56.1016 -61.2591
quadrupole: 9.3936 0.0048 0.0052
quadrupole: 4.4075 0.3750 -4.7825 9.3936 0.0048 0.0052
hfenergy: -459.4724215 hartree
pointgroup: C01 [X(C8H8O2)]
dipole: 1.3935574 0.7829231 -0.0804956 debye
dipolederiv: -0.241378 0.1978768 -0.0105688 0.1952997 -0.5091009 0.021134 -0.0109435 0.0211289 -0.1278583 -0.9606173 -0.0441928 0.0151277 -0.6074119 -0.7933395 0.0437186 0.0518802 0.0318081 -0.328979 -0.5444985 -0.0633492 0.0154548 0.0416649 0.3025777 -0.0181005 0.0095649 -0.0163971 0.0359077 1.0035986 -0.0372439 -0.0181983 -0.22162 0.0968453 -0.0057718 -0.0056086 -0.0092858 -0.0514794 0.3585371 0.1004853 -0.0173256 0.0699921 0.0091857 -0.0141296 -0.0156875 -0.0146514 -0.1847172 -1.5654338 0.1017063 0.0188853 0.4462598 -0.0077974 -0.0230358 -0.0040493 -0.0163582 -0.2239649 -0.0466329 -0.0213789 -0.0019398 -0.4105969 -0.1609222 0.0049468 0.023536 -0.0025418 -0.206649 -0.2280821 -0.1562731 0.0122777 -0.0476786 0.2481522 -0.0223192 0.0056881 -0.0201693 -0.1071858 2.1898511 -0.2123019 -0.0247972 0.3156849 0.8909492 -0.0585041 -0.0591313 -0.0476333 0.1276352 -0.29736 0.2396866 -0.0098331 0.4186571 -0.3374768 0.0187454 -0.0221968 0.0223457 0.0533355 0.0966784 -0.0185413 0.0025084 -0.003948 -0.0006893 0.0108162 0.0012834 0.0110822 0.1599161 0.1274987 -0.0339909 0.003713 -0.0263732 -0.0051148 0.0139403 0.0032816 0.0140377 0.1993232 0.0615186 -0.0283335 0.0040794 -0.0434956 -0.0581623 0.0163649 0.0051345 0.0161733 0.1735177 -0.0403857 0.031571 0.0028211 0.0346604 0.1259481 0.0043223 0.0026236 0.0043981 0.2024384 0.0824822 -0.0215842 0.004121 -0.0328222 0.0325061 0.0127757 0.0048964 0.0125275 0.2165864 0.0610054 0.001297 0.0644313 -0.0133982 0.0625906 0.0862581 0.0176124 0.1053819 -0.0444251 -0.1153645 -0.0244263 0.0055725 -0.0963955 0.0683778 0.0051402 0.0101715 0.0040214 0.1214042 0.0585827 -0.0110073 -0.0663295 -0.0184789 0.0354705 -0.0963014 -0.0180554 -0.1158681 -0.0148057 unknown
polarizability: 189.1046045|-4.7516002|90.0442292|-2.5209055|-3.0203373|43.234643 unknown
InChI: InChI=1S/C8H8O2/c1-7(9)4-5-8-3-2-6-10-8/h2-6H,1H3
charge 0 multiplicity 1
18 atoms
O  1.557512 1.037942 -0.095214
O  -3.097005 -1.246241 0.144948
C  1.098323 -0.304241 0.002083
C  -0.313842 -0.559936 0.046624
C  2.209716 -1.153606 0.03535
C  -1.316414 0.378556 0.003401
C  3.390075 -0.333518 -0.042188
C  2.956554 0.983325 -0.119758
C  -2.743974 -0.028087 0.057812
C  -3.773709 1.095103 -0.000602
H  -0.615887 -1.613738 0.122646
H  2.169888 -2.238887 0.10695
H  -1.080169 1.446473 -0.07247
H  4.424537 -0.669783 -0.041095
H  3.463831 1.941281 -0.192688
H  -3.656379 1.679778 -0.932936
H  -4.791036 0.678216 0.04344
H  -3.628323 1.798064 0.841799
