program: Gaussian 09
title: 000212989
version: EM64L-G09RevD.01
frameworkgroup: C1[X(C21H25N2O)]
method: RPBEPBE
basis: SDD
operation: Freq
keyword: #p
keyword: freq=noraman
keyword: PBEPBE/SDD
title: #p freq=noraman PBEPBE/SDD
converged: YES YES NO NO
title: Mulliken charges:
elementType: O N N C C C C C C C C C C C C C C C C C C C C C H H H H H H H H H H H H H H H H H H H H H H H H H
charge: -0.227813 -0.115831 -0.066658 -0.350546 -0.412439 -0.550214 -0.546573 -0.551023 -0.313332 -0.199790 0.219258 0.270958 0.385164 0.399523 -0.432833 -0.416011 -0.376997 -0.331579 -0.413325 -0.408617 -0.247342 -0.245998 -0.239890 -0.235007 0.258061 0.322905 0.240391 0.231253 0.300573 0.251431 0.260697 0.259987 0.280077 0.263240 0.259027 0.265448 0.278904 0.221173 0.246529 0.224804 0.225365 0.263837 0.257230 0.254714 0.251276 0.247613 0.246546 0.247963 0.247869
chargesum: 1.00000
title: Mulliken charges with hydrogens summed into heavy atoms:
elementType: O N N C C C C C C C C C C C C C C C C C C C C C
charge: -0.227813 -0.115831 -0.066658 0.230420 0.059205 0.262487 0.256732 0.252356 0.154370 -0.199790 0.219258 0.270958 0.385164 0.399523 -0.208029 -0.190646 -0.113160 -0.074348 -0.158611 -0.157341 0.000272 0.000548 0.008073 0.012862
polarizability: 2.51687505e+02 -4.91187422e+01 2.95705430e+02 3.56971356e+01 8.93428633e+00 2.15857389e+02
1716.lowfreq: -11.2499 -8.3297 -2.8223 -0.0008 -0.0006 0.0004 6.5448 18.1470 35.0269
frequency: -9.7357 17.4879 35.0066 43.6365 54.2118 67.5828 102.0573 106.4361 136.3535 173.2143 178.7087 201.8686 221.0281 228.8840 254.8289 258.3175 282.3307 293.2928 302.1130 322.1198 343.1103 345.9394 353.0008 365.4597 388.4593 421.4629 432.1458 433.7357 456.8010 475.0794 482.2749 512.3277 532.6625 535.2307 585.5761 602.4598 635.5339 675.3903 687.0757 710.9818 718.7737 732.9698 751.6465 768.3424 777.9595 782.7270 791.7185 818.2020 828.4006 858.4382 869.2939 893.0303 895.5301 899.1790 925.1773 935.3436 947.4493 963.2687 967.4627 981.5302 992.4276 999.2127 1003.3622 1031.8020 1039.9107 1043.5987 1050.5855 1053.4219 1074.9763 1097.3619 1114.5622 1117.9217 1122.6762 1166.1898 1176.4317 1181.2411 1184.6260 1186.0627 1219.0266 1230.3662 1237.4274 1249.7434 1250.7503 1259.2600 1279.4245 1298.7294 1317.9780 1327.5924 1330.6671 1354.0725 1378.6269 1379.4701 1386.4547 1411.7350 1419.6606 1420.5939 1421.4862 1447.5251 1449.0540 1455.3674 1456.2156 1460.0117 1463.8681 1469.6919 1474.1376 1477.9759 1485.5578 1486.0415 1493.0892 1502.8865 1518.0310 1563.0365 1567.8236 1599.7648 1603.2243 1632.8113 3000.1862 3003.4004 3008.6375 3021.4417 3024.6138 3028.3853 3063.4766 3087.9394 3093.8418 3099.7205 3119.1278 3130.4554 3132.2752 3137.1844 3139.5989 3142.8307 3143.5807 3144.8990 3147.9117 3150.4046 3154.5993 3157.1021 3164.2226 3172.5287 3178.3316
redmass: 4.2968 3.9205 2.9780 3.8595 4.5220 3.8066 4.6807 3.5054 2.0985 4.2772 1.6516 4.0176 3.5424 2.0509 1.1378 3.3268 1.2606 3.9117 2.2328 4.5263 3.2568 3.5265 2.5746 4.8048 3.4076 3.1343 2.3988 2.8440 2.6701 4.1029 3.4770 3.6963 3.8238 4.7948 3.1217 5.3078 5.1051 5.8034 5.1982 4.9528 3.2536 1.6156 2.5550 2.3161 1.7617 1.9864 2.9791 1.5201 3.9674 2.6585 2.3559 2.2273 1.5705 2.7311 2.9325 3.0970 2.8433 1.4344 1.4183 3.2035 1.3347 1.3423 1.3463 2.9114 2.6824 1.2014 2.0785 1.7510 1.8068 2.8449 1.4650 1.8444 1.7264 2.0612 1.9216 1.1401 1.1966 1.2478 1.6377 1.9976 1.5085 1.4322 1.8028 1.5889 1.2977 1.5265 1.3464 1.9928 1.3380 1.2330 1.2554 9.5080 4.8241 1.6698 1.9625 1.1401 1.1497 1.1026 1.0683 1.0963 2.0144 1.1046 1.0622 1.0704 2.5027 1.0573 1.4268 1.7086 1.0732 1.0759 6.3773 7.1059 6.8623 5.9373 5.9065 6.9725 1.0624 1.0640 1.0588 1.0321 1.0321 1.0336 1.1022 1.1074 1.0844 1.1009 1.0943 1.0879 1.0881 1.1054 1.1058 1.1052 1.0885 1.1056 1.0893 1.1050 1.1047 1.0941 1.0948 1.1007 1.0997
irintensity: 2.0874 3.7380 1.0818 1.3138 2.6593 1.0517 2.2662 0.6733 4.2531 3.2351 0.3323 0.2352 1.2173 2.5944 1.4921 2.6967 0.9417 6.9817 1.0595 4.1646 2.3112 1.0343 0.0835 1.9480 1.6228 2.3206 4.9062 0.3955 3.6453 5.6228 6.5745 0.8392 5.4704 0.4080 0.0195 6.3574 17.4736 6.5318 1.3472 5.6362 2.9731 14.2915 3.0698 64.7981 7.3266 54.2894 25.6963 94.6531 9.1793 17.4647 15.4339 35.2817 3.8320 100.9172 2.6964 34.5210 22.2129 2.3716 11.9747 4.2635 1.3810 0.3188 0.9752 75.2428 1.3315 0.2182 6.1601 9.2645 0.5908 3.0160 4.3016 0.8795 1.9774 6.2447 3.7638 2.0963 1.5445 1.8903 1.5579 3.8611 3.3264 0.2464 3.4291 2.0543 8.3820 6.2045 12.9535 10.4622 29.1405 9.8754 22.1705 12.5382 11.4653 2.6635 8.3842 23.6477 13.7542 4.2868 2.9233 1.0462 5.0185 14.3821 1.8611 3.8333 3.3126 17.6701 65.1636 12.0162 39.8570 62.0551 14.3333 8.8905 3.4313 3.9531 6.9757 3.7389 26.1526 77.6038 14.9236 5.5789 2.3917 9.3234 28.4950 8.7991 0.1220 7.5786 19.2782 4.1180 7.5957 0.8070 1.3920 2.9420 2.9854 5.8466 5.2541 1.4339 6.7096 11.9820 13.8388 16.9006 11.8272
temp: 298.150 k
press: 1.00000 atm
elementType: 8 7 7 6 6 6 6 6 6 6 6 6 6 6 6 6 6 6 6 6 6 6 6 6 1 1 1 1 1 1 1 1 1 1 1 1 1 1 1 1 1 1 1 1 1 1 1 1 1
symmnumber: 1
zpe: 1085149.8 jmol-1
zpe.correction: 0.413312 hartree
zpe.thermalcorrener: 0.434831 hartree
zpe.thermalcorrenthalpy: 0.435775 hartree
zpe.thermalcorrgfe: 0.362688 hartree
zpe.sumelectzpe: -997.916967 hartree
zpe.sumelectthermal: -997.895447 hartree
zpe.sumelectthermalent: -997.894503 hartree
zpe.sumelectthermalfe: -997.967590 hartree
dipole: -13.1309 -1.6893 3.1509
dipole: 13.6089
quadrupole: -63.8736 -112.8265 -120.0876
quadrupole: 1.3563 -4.6121 3.0627
quadrupole: 35.0557 -13.8973 -21.1584 1.3563 -4.6121 3.0627
hfenergy: -998.3302785 hartree
pointgroup: C01 [X(C21H25N2O1)]
dipole: -4.1248379 1.8497263 2.8690324 debye
polarizability: 205.9715806|-7.3706787|265.2655625|41.6989136|40.4238078|292.0131798 unknown
InChI: InChI=1S/C21H25N2O/c1-23(2,3)15-8-16-24-22-21-19-11-6-4-9-17(19)13-14-18-10-5-7-12-20(18)21/h4-7,9-14H,8,15-16H2,1-3H3
charge 1 multiplicity 1
49 atoms
O  -1.689474 0.66947 -2.175128
N  -3.362922 1.338981 1.82263
N  -0.733099 0.873884 -1.067608
C  -3.026728 2.031183 0.473541
C  -3.655873 1.387942 -0.780375
C  -2.749352 -0.062019 1.871121
C  -2.740995 2.176395 2.939961
C  -4.870122 1.25531 2.033333
C  -2.777503 1.654998 -2.030169
C  0.206622 -0.063311 -1.002125
C  1.176154 0.190373 0.107542
C  0.370559 -1.206809 -1.941581
C  1.516374 -0.81703 1.070877
C  0.531788 -2.552883 -1.47389
C  1.068099 -2.211449 1.016246
C  0.648296 -2.947393 -0.066924
C  1.701438 1.504081 0.250602
C  0.33413 -0.951405 -3.339154
C  2.346781 -0.439882 2.170684
C  0.589521 -3.601076 -2.441692
C  2.544045 1.84231 1.328293
C  0.4456 -1.998083 -4.273737
C  2.861017 0.86218 2.300859
C  0.558942 -3.335124 -3.821044
H  -3.351977 3.080887 0.586525
H  -1.927578 1.99131 0.379851
H  -4.672902 1.78264 -0.959343
H  -3.738553 0.288956 -0.691758
H  -1.672595 0.011706 1.656936
H  -2.9149 -0.483679 2.874711
H  -3.228427 -0.702377 1.11791
H  -2.94601 1.697874 3.910007
H  -1.654754 2.238021 2.774215
H  -3.179511 3.185734 2.921295
H  -5.072474 0.796528 3.013736
H  -5.294314 2.270761 2.001644
H  -5.315283 0.641153 1.237847
H  -2.35831 2.679627 -2.027533
H  -3.368892 1.510169 -2.949045
H  1.185703 -2.76413 1.958601
H  0.467334 -4.015071 0.118653
H  1.447645 2.252369 -0.506559
H  0.21259 0.076896 -3.689441
H  2.608367 -1.202178 2.91385
H  0.690444 -4.634357 -2.090091
H  2.955227 2.853927 1.407805
H  0.427466 -1.777965 -5.345881
H  3.515741 1.111222 3.142394
H  0.626568 -4.157563 -4.540391
