program: Gaussian 09
title: 000212923
version: EM64L-G09RevD.01
frameworkgroup: C1[X(C15H18N2O4)]
method: RPBEPBE
basis: SDD
operation: Freq
keyword: #p
keyword: freq=noraman
keyword: PBEPBE/SDD
title: #p freq=noraman PBEPBE/SDD
converged: YES YES NO NO
title: Mulliken charges:
elementType: O O O O N N C C C C C C C C C C C C C C C H H H H H H H H H H H H H H H H H H
charge: -0.309295 -0.297246 -0.330036 -0.300872 -0.370367 -0.633653 0.196194 0.453294 -0.337622 -0.415119 -0.749692 -0.387230 -0.420783 -0.265795 -0.261831 -0.242718 0.373464 0.295189 -0.458786 0.223002 -0.475330 0.229991 0.265308 0.250460 0.234602 0.219975 0.233980 0.230098 0.221565 0.284730 0.223999 0.231319 0.229061 0.333065 0.327589 0.394143 0.274640 0.251396 0.279313
chargesum: 0.00000
title: Mulliken charges with hydrogens summed into heavy atoms:
elementType: O O O O N N C C C C C C C C C C C C C C C
charge: -0.309295 -0.297246 -0.330036 -0.300872 -0.037302 0.088079 0.196194 0.453294 0.157677 0.069943 -0.065639 -0.165665 -0.136053 -0.041797 -0.030512 -0.013657 0.373464 0.295189 0.067250 0.223002 -0.196017
polarizability: 2.40360071e+02 -2.92716841e+00 1.71706041e+02 -2.31833470e+01 -1.96786837e-01 1.39309380e+02
1716.lowfreq: -6.9651 -0.0005 -0.0004 0.0005 3.3911 10.1396 15.8269 31.0826 43.0575
frequency: 15.2583 31.0418 43.0045 47.2998 65.4905 79.5500 87.0541 112.9471 121.5880 142.9373 165.5521 177.3037 208.1699 215.6333 232.4484 247.1162 272.1299 279.5398 293.8621 308.7436 343.0832 362.8232 369.7100 408.2273 438.5689 473.3347 515.5263 526.9611 532.6503 558.3459 580.2544 605.5586 615.6561 618.0075 637.0665 651.0731 674.8081 697.7114 700.3891 712.5059 732.4014 746.5904 768.4933 798.4652 823.7468 856.6753 860.2307 913.7159 923.4846 931.9277 953.2727 964.8101 983.2641 988.8316 1003.1876 1005.8511 1020.4351 1027.9898 1041.9670 1089.5847 1093.1791 1097.0715 1117.3695 1142.2738 1174.9167 1179.6760 1201.4450 1211.2807 1222.0110 1242.7494 1262.1405 1280.5464 1305.7799 1335.5576 1346.2606 1361.6606 1371.6829 1375.7239 1393.6370 1434.6296 1457.8605 1462.6508 1469.9662 1481.0330 1485.1607 1492.6154 1495.2279 1587.5558 1589.6237 1611.9046 1654.8535 1687.4329 2146.9946 2980.6810 2987.4874 3028.2475 3030.3660 3052.1250 3081.8900 3091.2470 3098.1027 3105.9882 3117.4096 3127.1151 3137.6765 3146.3836 3162.1912 3418.7544 3425.8427 3576.0083 3673.5568
redmass: 5.4798 5.6505 4.2498 4.4130 5.0860 5.2909 5.3161 6.5789 4.3682 8.6988 5.6915 4.7253 5.0746 4.4909 1.2011 5.4053 3.8741 3.1611 4.6608 2.7273 2.7046 3.3280 2.5192 2.8862 5.1292 2.9095 2.3841 1.2594 2.7485 1.9658 2.0608 4.7180 4.7836 6.0198 1.2374 5.7664 1.2402 9.4311 6.4766 1.8609 3.9644 1.1456 1.9228 4.3063 3.1009 2.2358 1.5362 2.1206 3.1982 1.4759 1.6681 4.6879 1.4141 4.8483 1.7021 1.3703 2.5764 2.6421 5.7619 1.8586 1.8536 2.1031 4.9657 3.3297 1.2015 1.8217 2.1372 1.2366 1.8946 1.1274 1.5072 1.3085 2.3409 1.4043 1.2861 1.2810 1.4144 4.3387 1.2023 2.2418 1.0864 1.0818 1.1779 1.0909 1.1189 1.8142 1.6432 1.9015 2.3837 5.7049 4.9872 8.8435 5.9847 1.0643 1.0358 1.0572 1.0582 1.0952 1.0999 1.1044 1.1013 1.1067 1.0856 1.0871 1.0923 1.0959 1.1016 1.0577 1.1598 1.0777 1.0951
irintensity: 0.1988 0.2584 0.0492 1.2815 0.5972 2.7611 0.9607 7.6821 3.2418 9.6095 2.9848 0.6349 1.3008 6.3716 1.1717 3.4946 5.4892 6.2691 11.9947 10.1121 13.9225 3.3941 17.3284 0.1957 7.4330 2.5417 45.2291 97.3326 30.8061 61.5283 58.3938 4.0160 11.3993 4.0229 76.2697 5.2865 68.6586 32.2018 12.8656 51.2909 12.9886 139.9639 39.9701 20.6220 12.1147 5.3572 2.3630 5.1054 19.2275 3.8611 20.7932 167.5513 1.0895 0.0351 6.4938 1.8800 96.5879 13.6428 135.6523 11.1845 14.6877 8.1448 88.1203 27.1303 0.9380 5.6650 312.4690 1.8864 10.7576 102.9827 28.7012 8.0573 229.5887 3.3893 23.3265 4.0977 58.0795 1.5222 10.5360 11.1439 18.4787 31.1480 6.1187 44.1683 9.3409 410.4030 4.0201 173.8083 94.2792 5.8648 226.8488 337.1502 0.3089 40.8842 22.9667 39.7596 22.1175 3.5630 22.8636 4.9298 41.3971 6.0419 7.4808 8.6438 30.2589 12.0334 38.8796 221.6006 66.1793 41.4765 100.3633
temp: 298.150 k
press: 1.00000 atm
elementType: 8 8 8 8 7 7 6 6 6 6 6 6 6 6 6 6 6 6 6 6 6 1 1 1 1 1 1 1 1 1 1 1 1 1 1 1 1 1 1
symmnumber: 1
zpe: 811172.2 jmol-1
zpe.correction: 0.308959 hartree
zpe.thermalcorrener: 0.330156 hartree
zpe.thermalcorrenthalpy: 0.331101 hartree
zpe.thermalcorrgfe: 0.257341 hartree
zpe.sumelectzpe: -991.193901 hartree
zpe.sumelectthermal: -991.172704 hartree
zpe.sumelectthermalent: -991.171759 hartree
zpe.sumelectthermalfe: -991.245519 hartree
dipole: -1.9812 -3.1816 -0.3672
dipole: 3.7660
quadrupole: -106.7471 -120.9465 -121.7154
quadrupole: -1.9772 -5.4970 -6.0168
quadrupole: 9.7226 -4.4769 -5.2457 -1.9772 -5.4970 -6.0168
hfenergy: -991.50286 hartree
pointgroup: C01 [X(C15H18N2O4)]
dipole: -0.9589403 1.117279 -0.1656568 debye
polarizability: 235.1317014|18.5031308|174.074218|24.9558448|-3.4585381|142.1695731 unknown
InChI: InChI=1S/C15H18N2O4/c1-3-9-17-14(19)21-11-15(2,10-20-13(16)18)12-7-5-4-6-8-12/h1,4-8,17H,9-11,16H2,2H3
charge 0 multiplicity 1
39 atoms
O  -1.333436 1.321606 -0.219776
O  -0.285127 -1.325612 -0.319427
O  -2.023986 0.007785 1.63456
O  1.226328 -3.111491 0.024812
N  -3.505485 0.728209 -0.030284
N  -0.476659 -2.544646 1.560285
C  1.00871 0.735786 -0.920133
C  2.44167 0.739183 -0.321744
C  0.087148 1.28603 0.212769
C  0.503165 -0.673109 -1.375508
C  0.93464 1.653744 -2.175237
C  3.068702 1.983525 -0.029467
C  3.152257 -0.448701 -0.006605
C  4.358927 2.042576 0.538937
C  4.446976 -0.390863 0.559756
C  5.05955 0.850886 0.834401
C  -2.264596 0.617493 0.55548
C  0.254312 -2.409459 0.408364
C  -4.692191 0.078433 0.545068
C  -5.338615 -0.876011 -0.379393
C  -5.902319 -1.655164 -1.149987
H  0.358419 2.330156 0.44459
H  0.1638 0.670542 1.123726
H  1.323795 -1.334474 -1.704153
H  -0.210746 -0.548708 -2.205509
H  1.338511 2.660163 -1.974968
H  -0.114933 1.765779 -2.500699
H  1.519486 1.219872 -3.006983
H  2.555243 2.926069 -0.253539
H  2.711405 -1.43478 -0.185284
H  4.815932 3.016478 0.7484
H  4.971864 -1.325253 0.788386
H  6.06319 0.891178 1.272265
H  -3.575153 1.219322 -0.921969
H  -0.267032 -3.316747 2.186281
H  -1.154012 -1.810567 1.803157
H  -4.353424 -0.440862 1.459926
H  -5.432589 0.841838 0.855982
H  -6.382428 -2.345811 -1.819378
