program: Gaussian 09
title: 000212934
version: EM64L-G09RevD.01
frameworkgroup: C1[X(C21H22N2O)]
method: RPBEPBE
basis: SDD
operation: Freq
keyword: #p
keyword: freq=noraman
keyword: PBEPBE/SDD
title: #p freq=noraman PBEPBE/SDD
converged: YES YES NO NO
title: Mulliken charges:
elementType: O N N C C C C C C C C C C C C C C C C C C C C C H H H H H H H H H H H H H H H H H H H H H H
charge: -0.454002 0.012416 -0.019626 -0.388547 -0.383336 -0.444542 -0.453357 -0.317936 -0.478294 -0.217622 0.271699 0.198561 0.389508 0.418849 -0.373868 -0.329241 -0.420629 -0.415755 -0.418501 -0.422159 -0.247056 -0.258314 -0.246457 -0.240947 0.272793 0.232210 0.248087 0.261681 0.226576 0.238185 0.245310 0.225988 0.238041 0.224014 0.215389 0.276053 0.258091 0.247242 0.211578 0.212391 0.238593 0.240673 0.229409 0.234679 0.229570 0.232604
chargesum: 0.00000
title: Mulliken charges with hydrogens summed into heavy atoms:
elementType: O N N C C C C C C C C C C C C C C C C C C C C C
charge: -0.454002 0.012416 -0.019626 0.116456 0.126432 0.020219 0.017940 0.144119 0.013148 -0.217622 0.271699 0.198561 0.389508 0.418849 -0.115777 -0.081999 -0.209051 -0.203364 -0.179908 -0.181487 -0.017647 -0.023635 -0.016886 -0.008343
polarizability: 2.64288998e+02 1.94913705e+01 3.21187165e+02 -3.59274546e+01 6.63876168e+00 1.91379005e+02
1716.lowfreq: -29.1372 -12.0686 -5.9403 -0.0006 -0.0001 0.0005 5.7511 15.2354 35.2876
frequency: -26.8334 12.6198 35.1259 50.9131 66.8367 88.7570 100.0033 117.2717 156.9320 168.2988 181.4987 197.5976 219.6903 241.4228 279.0620 304.1024 322.7986 335.0868 360.6116 389.6326 396.0753 419.1402 451.3373 469.0378 475.9164 482.0695 524.3785 542.6627 579.6320 588.7288 595.8783 613.9845 634.9184 671.4857 683.5335 712.9039 715.8310 729.4842 747.9753 776.9285 781.5390 784.2274 792.0567 803.8411 814.6253 832.0221 851.7053 864.7298 876.3078 887.3872 890.5826 924.9037 932.7751 938.9795 955.1062 960.7304 968.3730 972.5370 985.2820 989.7464 995.0859 1010.5522 1039.4132 1048.0961 1053.4321 1063.2270 1091.8402 1098.4789 1103.3102 1116.1324 1164.1324 1170.0884 1173.4270 1176.3750 1179.1356 1182.6457 1206.9107 1228.4704 1229.5297 1241.3442 1246.7756 1251.5554 1258.7438 1274.1430 1293.0922 1296.8957 1301.7766 1308.1893 1314.9424 1321.4158 1360.4193 1380.2718 1387.2104 1410.5332 1418.6613 1442.4346 1455.3731 1456.8644 1466.6864 1474.4065 1475.9948 1476.3776 1487.1086 1493.9066 1557.0385 1568.9071 1581.1242 1603.8085 1605.7476 1638.1545 2980.7596 3011.2553 3013.8177 3025.9612 3046.6006 3054.2580 3055.8154 3065.8784 3086.8061 3087.4761 3095.5078 3113.3155 3120.2217 3122.1538 3126.0730 3132.8454 3134.8153 3135.1357 3147.8313 3152.6879 3166.6012 3167.3831
redmass: 4.0060 4.3993 4.6466 4.7328 3.7495 2.6602 2.4859 3.7068 5.0416 3.1907 2.4789 3.5633 4.0578 3.8322 3.7744 3.7315 5.3338 3.6279 5.2766 3.4235 3.8149 3.9685 3.2111 3.6635 3.8458 3.4626 6.1225 4.5413 4.0881 3.1334 3.7518 3.2509 5.1284 5.3439 5.0893 4.1533 3.0832 1.4622 2.1662 1.7660 1.6162 1.8717 1.9055 2.9822 1.5976 1.6994 2.8151 2.1717 3.0278 1.8505 1.7701 4.8356 2.8811 3.6977 1.4866 1.4032 2.2529 1.7155 1.3400 1.3402 1.3381 3.6409 2.6336 2.1644 1.7667 2.8938 2.5761 2.0332 2.5319 1.8312 2.0306 1.3926 1.2316 1.1596 1.4949 1.3095 1.3120 1.9636 1.1380 1.5502 1.4651 1.5811 1.1959 1.2930 1.2640 1.4444 1.4626 1.5752 1.4706 1.4719 1.4000 8.6975 5.5493 1.6410 2.0646 1.0798 1.0953 2.1317 1.0818 1.0817 1.1000 2.3424 2.9898 1.0964 7.2679 6.9710 9.0370 6.1871 6.1826 7.1462 1.0616 1.0592 1.0596 1.0615 1.0619 1.0682 1.0906 1.1014 1.0839 1.1039 1.1051 1.0941 1.0869 1.0873 1.1077 1.1083 1.0880 1.0886 1.0941 1.0943 1.1006 1.0996
irintensity: 3.3049 1.8879 1.6644 0.8179 0.4368 2.3022 0.7674 0.9468 4.9428 1.7499 0.9052 1.0617 4.9072 3.0613 1.4062 17.9733 4.1861 5.1651 8.4676 1.0652 8.4492 1.9999 19.1152 11.0441 3.7575 5.4466 2.1178 2.3747 0.4721 0.6176 8.1507 4.7984 9.0832 1.1737 7.5370 1.4018 5.7661 22.5708 4.5163 10.9377 6.9228 62.3197 6.9033 4.9220 75.9917 2.0567 7.8871 0.3097 0.4298 6.9154 4.2535 16.8703 13.0472 2.5984 4.5729 7.2878 6.8169 6.3629 0.2335 0.4007 1.0048 4.1238 2.7609 3.9863 3.0685 0.0452 2.4493 5.1430 7.2399 1.8329 3.5287 0.9849 0.4172 0.2283 2.9380 0.8584 1.5896 3.6439 3.5122 2.1928 1.3445 1.3550 2.8277 1.5011 2.1158 8.0733 11.4620 3.5772 11.0109 7.8417 3.1124 6.2019 5.9243 5.3521 6.0104 4.7078 6.9205 0.2113 12.4065 8.6086 13.2217 4.6784 9.0046 13.6870 11.4064 0.5340 85.2287 9.9262 4.2634 0.9798 10.7603 15.1063 25.8791 45.1782 16.8786 1.9085 5.3867 6.5942 0.2210 35.0807 15.0410 23.0658 6.6779 19.2786 11.2797 34.6784 1.4057 12.3694 25.2419 26.9931 39.2969 16.2265
temp: 298.150 k
press: 1.00000 atm
elementType: 8 7 7 6 6 6 6 6 6 6 6 6 6 6 6 6 6 6 6 6 6 6 6 6 1 1 1 1 1 1 1 1 1 1 1 1 1 1 1 1 1 1 1 1 1 1
symmnumber: 1
zpe: 995717.7 jmol-1
zpe.correction: 0.379249 hartree
zpe.thermalcorrener: 0.398798 hartree
zpe.thermalcorrenthalpy: 0.399743 hartree
zpe.thermalcorrgfe: 0.330023 hartree
zpe.sumelectzpe: -996.341252 hartree
zpe.sumelectthermal: -996.321703 hartree
zpe.sumelectthermalent: -996.320758 hartree
zpe.sumelectthermalfe: -996.390478 hartree
dipole: 0.0028 -3.0534 0.2178
dipole: 3.0612
quadrupole: -124.6182 -136.5980 -132.3518
quadrupole: -17.4278 -6.6835 0.3308
quadrupole: 6.5711 -5.4087 -1.1625 -17.4278 -6.6835 0.3308
hfenergy: -996.7205011 hartree
pointgroup: C01 [X(C21H22N2O1)]
dipole: 0.1633038 1.1930234 0.022701 debye
polarizability: 269.1055164|28.8025564|313.1436096|34.8786737|-17.6762721|194.6060416 unknown
InChI: InChI=1S/C21H22N2O/c24-23(14-5-6-15-23)16-13-22-21-19-9-3-1-7-17(19)11-12-18-8-2-4-10-20(18)21/h1-4,7-12H,5-6,13-16H2
charge 0 multiplicity 1
46 atoms
O  -4.158047 -1.269563 0.06356
N  -4.07342 0.144812 0.099656
N  -0.360795 0.534515 -0.488532
C  -4.613472 0.80961 -1.193964
C  -5.017086 0.75754 1.162304
C  -5.014441 2.251084 -0.811187
C  -5.243634 2.225006 0.746122
C  -2.625978 0.582488 0.369576
C  -1.633599 -0.220524 -0.492635
C  0.817944 -0.03117 -0.354398
C  1.986745 0.910095 -0.357861
C  1.075685 -1.512547 -0.300799
C  3.02735 0.868617 0.625859
C  1.855008 -2.131946 0.730911
C  1.991339 1.943258 -1.331505
C  0.465719 -2.333306 -1.288225
C  3.132247 -0.131509 1.692478
C  2.621284 -1.405486 1.746927
C  4.019901 1.896781 0.603227
C  1.917143 -3.558206 0.771808
C  3.000289 2.925137 -1.358238
C  0.581384 -3.736624 -1.258938
C  4.021959 2.903772 -0.37649
C  1.298164 -4.355033 -0.206345
H  -5.470288 0.175379 -1.469506
H  -3.846612 0.737461 -1.97923
H  -4.565103 0.611901 2.154825
H  -5.924852 0.137793 1.086066
H  -5.930084 2.553874 -1.347125
H  -4.225328 2.975089 -1.07777
H  -4.534628 2.899751 1.256139
H  -6.261351 2.557359 1.012135
H  -2.435424 0.38762 1.437807
H  -2.512143 1.663483 0.16749
H  -2.011873 -0.269732 -1.53362
H  -1.581785 -1.259739 -0.124757
H  1.168973 1.96854 -2.052796
H  -0.104173 -1.856828 -2.092985
H  3.77923 0.165849 2.529872
H  2.905659 -2.00666 2.621944
H  4.804324 1.882829 1.369676
H  2.487812 -4.033742 1.578591
H  2.985908 3.70813 -2.124249
H  0.100085 -4.342175 -2.033914
H  4.806386 3.668481 -0.377549
H  1.37468 -5.446471 -0.156159
