program: Gaussian 09
title: 000212901
version: EM64L-G09RevD.01
frameworkgroup: C1[X(C12H25NO3)]
method: RPBEPBE
basis: SDD
operation: Freq
keyword: #p
keyword: freq=noraman
keyword: PBEPBE/SDD
title: #p freq=noraman PBEPBE/SDD
converged: YES YES NO NO
title: Mulliken charges:
elementType: O O O N C C C C C C C C C C C C H H H H H H H H H H H H H H H H H H H H H H H H H
charge: -0.339913 -0.443522 -0.292370 -0.381021 0.400324 -0.412334 -0.454326 -0.412119 -0.785055 -0.385435 -0.699357 -0.047415 0.301171 -0.333472 -0.695391 -0.686480 0.195974 0.191542 0.248539 0.256564 0.219176 0.200107 0.243430 0.218471 0.216288 0.206637 0.232538 0.216874 0.202824 0.216731 0.243379 0.354822 0.199303 0.185823 0.306961 0.219751 0.200269 0.235666 0.215707 0.216383 0.222958
chargesum: 0.00000
title: Mulliken charges with hydrogens summed into heavy atoms:
elementType: O O O N C C C C C C C C C C C C
charge: -0.339913 -0.088700 -0.292370 -0.074060 0.400324 -0.024819 0.050777 0.007164 -0.106866 0.053740 -0.062929 0.195964 0.301171 0.051655 -0.039705 -0.031432
polarizability: 1.76180478e+02 -1.96520432e-01 1.46007027e+02 4.06723822e+00 -1.02863040e+00 1.24998350e+02
1716.lowfreq: -10.4414 -6.1650 -0.0004 -0.0002 0.0009 8.0499 15.5071 27.4296 32.5997
frequency: 13.5215 27.2527 32.5541 58.0371 64.1592 79.5528 87.8114 104.5284 115.7141 142.7265 165.3284 206.0423 212.0727 218.1106 225.8937 237.5495 244.5219 255.8474 289.2626 301.6695 327.5965 340.5180 367.9331 380.8309 415.4283 439.6325 467.5471 512.4893 544.7495 568.3326 590.3151 651.6643 687.7940 742.3693 769.1606 773.2866 818.1446 859.9628 862.9842 875.0591 899.2516 903.9086 930.8428 952.7648 966.9314 982.1786 987.2292 997.0988 1020.3172 1046.1429 1055.6465 1056.6594 1100.7452 1117.1598 1144.0005 1149.5401 1174.6245 1174.8790 1193.0866 1214.0885 1222.1748 1262.0996 1270.6707 1275.5362 1291.2713 1304.6857 1314.9533 1334.8308 1345.2688 1350.8619 1356.8235 1366.3477 1369.5629 1385.4146 1388.6686 1389.5948 1390.9346 1453.8353 1455.6852 1462.4804 1464.7153 1469.0710 1471.4900 1472.4062 1473.8440 1477.2205 1478.8530 1483.1343 1484.5772 1486.1607 1490.3707 1669.4765 2948.4565 2965.6868 2970.4423 2972.6924 2975.6175 2978.2004 2982.4106 2984.9549 2998.0673 3019.1490 3035.5970 3037.2197 3039.3825 3064.0638 3070.3131 3070.7690 3072.5534 3074.1064 3076.9195 3078.3874 3082.1779 3093.6421 3105.4749 3548.4727 3551.4523
redmass: 3.3680 3.6674 3.8051 4.1605 4.0486 2.8264 2.1542 1.8514 3.2990 3.9770 2.5934 2.0358 1.1471 1.5009 2.3592 1.3602 3.0011 1.0503 3.3455 2.3606 3.4692 2.9240 2.4032 3.0374 2.3597 2.3898 2.4414 1.2837 2.3340 1.3020 2.8853 5.7659 11.4625 1.1527 2.1815 1.6472 2.0559 1.6022 1.8407 2.9488 1.8502 2.2597 1.8531 1.7287 1.3520 3.0821 1.7892 1.6008 2.4399 1.9381 2.6530 2.2367 2.0686 2.3974 1.5109 2.0139 2.1314 2.3463 2.2417 2.6936 1.6288 1.2780 1.2125 1.4010 1.2582 1.4607 1.1967 1.4838 1.3125 1.2509 1.4195 1.2964 1.2456 1.2091 1.2142 1.2185 1.2134 1.0958 1.1233 1.1116 1.0756 1.1148 1.0570 1.0545 1.0463 1.0503 1.0511 1.0719 1.0678 1.0652 1.4283 9.4063 1.0593 1.0609 1.0363 1.0515 1.0468 1.0377 1.0363 1.0625 1.0947 1.0939 1.0585 1.0896 1.1006 1.1004 1.1018 1.0990 1.0990 1.0977 1.1001 1.0994 1.1001 1.1002 1.1077 1.0658 1.0767
irintensity: 0.3198 0.0561 0.6219 4.6555 3.5628 4.5015 1.1316 0.1089 1.3289 1.1817 0.7834 0.7341 0.5251 2.4821 1.9348 0.4153 8.9992 0.3995 3.8870 3.8426 3.7125 3.9846 23.2266 4.1899 2.0013 4.3244 6.3646 93.1405 25.6024 111.9839 13.0862 12.0058 20.4337 12.3566 9.3258 6.3859 5.7206 2.0607 1.3169 13.6302 9.7951 34.7125 13.3366 12.7638 35.1637 104.9287 72.8350 38.1550 92.8592 13.0009 33.0621 39.6234 10.9634 8.9084 34.3053 13.5362 1.6131 5.5137 205.5233 1.3307 4.5960 38.7603 2.0176 9.1949 5.7522 3.3015 5.2936 22.1494 19.5105 10.3420 5.3028 9.8442 8.7172 14.5172 3.4584 28.6219 10.6288 19.1325 50.4059 20.5324 4.1097 72.4681 12.4177 5.9864 24.1632 8.1424 7.0183 26.3299 3.1850 33.9266 169.0190 273.5125 19.3814 38.5332 28.4933 70.3117 20.6647 41.3509 17.8996 32.8331 36.0060 11.7440 32.3564 3.5985 3.8859 15.4029 79.2715 53.0466 62.1401 15.6338 28.0277 60.3127 56.3855 34.6973 8.2462 8.4908 25.9047
temp: 298.150 k
press: 1.00000 atm
elementType: 8 8 8 7 6 6 6 6 6 6 6 6 6 6 6 6 1 1 1 1 1 1 1 1 1 1 1 1 1 1 1 1 1 1 1 1 1 1 1 1 1
symmnumber: 1
zpe: 944178.3 jmol-1
zpe.correction: 0.359619 hartree
zpe.thermalcorrener: 0.380126 hartree
zpe.thermalcorrenthalpy: 0.381070 hartree
zpe.thermalcorrgfe: 0.308621 hartree
zpe.sumelectzpe: -751.382652 hartree
zpe.sumelectthermal: -751.362144 hartree
zpe.sumelectthermalent: -751.361200 hartree
zpe.sumelectthermalfe: -751.433649 hartree
dipole: 2.6145 0.2000 1.0488
dipole: 2.8241
quadrupole: -91.4267 -106.7260 -103.5358
quadrupole: -9.2211 5.2065 4.8395
quadrupole: 9.1361 -6.1631 -2.9730 -9.2211 5.2065 4.8395
hfenergy: -751.7422701 hartree
pointgroup: C01 [X(C12H25N1O3)]
dipole: -1.0014195 0.1491775 -0.4576029 debye
polarizability: 175.4777498|-0.881276|145.1434887|7.1511401|4.2410173|126.5646162 unknown
InChI: InChI=1S/C12H25NO3/c1-5-7-12(4,8-14)9-16-11(15)13-10(3)6-2/h10,13-14H,5-9H2,1-4H3
charge 0 multiplicity 1
41 atoms
O  0.132975 -1.366236 0.186862
O  2.348137 -2.563232 -1.422005
O  -0.885101 0.30355 1.520196
N  -2.047999 -0.835359 -0.17837
C  2.442141 -0.41701 -0.067786
C  2.088912 1.087154 -0.272881
C  1.439063 -1.131317 0.870072
C  2.403597 -1.09486 -1.474533
C  3.850967 -0.606652 0.552068
C  2.199789 2.001638 0.967944
C  1.817269 3.460839 0.636107
C  -3.345599 -0.141849 -0.027073
C  -0.949613 -0.544065 0.592088
C  -3.609971 0.826818 -1.212666
C  -4.480677 -1.176287 0.133044
C  -2.534909 1.921436 -1.369768
H  1.053866 1.159069 -0.66912
H  2.751205 1.48712 -1.071092
H  1.805026 -2.139135 1.126533
H  1.252018 -0.55212 1.789072
H  3.333673 -0.866353 -2.023534
H  1.543264 -0.698199 -2.05179
H  4.165581 -1.662304 0.460229
H  3.876603 -0.330325 1.622443
H  4.592824 0.021381 0.025034
H  3.232251 1.973735 1.367736
H  1.527587 1.63011 1.764447
H  0.77447 3.517252 0.270139
H  2.474806 3.879484 -0.14986
H  1.897055 4.110906 1.52656
H  -3.25381 0.453111 0.900238
H  1.432775 -2.812787 -1.133174
H  -4.601324 1.29497 -1.050895
H  -3.692157 0.237232 -2.149807
H  -1.946986 -1.554197 -0.897354
H  -5.447438 -0.665844 0.29107
H  -4.578169 -1.804529 -0.773666
H  -4.291189 -1.838333 0.995658
H  -1.542495 1.479011 -1.572155
H  -2.780318 2.5994 -2.207123
H  -2.447501 2.527374 -0.449586
