program: Gaussian 09
title: 000212902
version: EM64L-G09RevD.01
frameworkgroup: C1[X(C13H27NO3)]
method: RPBEPBE
basis: SDD
operation: Freq
keyword: #p
keyword: freq=noraman
keyword: PBEPBE/SDD
title: #p freq=noraman PBEPBE/SDD
converged: YES YES NO NO
title: Mulliken charges:
elementType: O O O N C C C C C C C C C C C C C H H H H H H H H H H H H H H H H H H H H H H H H H H H
charge: -0.339267 -0.443639 -0.288084 -0.367533 0.400001 -0.413543 -0.453504 -0.413367 -0.785687 -0.383409 -0.699814 -0.347826 -0.409073 -0.349676 0.301634 -0.347242 -0.691506 0.190711 0.199778 0.249551 0.255629 0.219380 0.200768 0.218699 0.216522 0.243486 0.206971 0.230669 0.216895 0.216439 0.202426 0.354999 0.198021 0.216877 0.184672 0.189841 0.213058 0.255392 0.319249 0.194686 0.199033 0.209224 0.209747 0.218812
chargesum: 0.00000
title: Mulliken charges with hydrogens summed into heavy atoms:
elementType: O O O N C C C C C C C C C C C C C
charge: -0.339267 -0.088641 -0.288084 -0.048284 0.400001 -0.023053 0.051677 0.006781 -0.106979 0.054232 -0.064054 0.067071 0.059377 0.024837 0.301634 0.046477 -0.053723
polarizability: 1.83286889e+02 3.23936147e-01 1.53656363e+02 2.57651134e+00 2.14104763e+00 1.40347194e+02
1716.lowfreq: -21.2600 -10.0851 -8.6168 -2.3373 -0.0002 0.0005 0.0008 15.3542 27.3890
frequency: -16.7870 14.9346 26.7802 43.1663 54.8303 56.4758 70.2209 85.5327 98.7369 117.3137 137.6714 143.5805 160.1363 202.7725 220.4965 227.9560 240.9380 252.0692 263.4744 271.7605 302.5558 320.2829 334.5142 370.5924 375.4761 384.8765 429.4957 486.8210 522.6653 547.3666 559.1490 593.5343 631.1513 691.0149 726.6369 737.2661 766.2019 770.8317 817.8213 858.2304 862.3272 876.7575 885.6741 900.0797 927.1012 930.9731 939.7591 963.6706 984.2473 989.0660 1004.2738 1043.0117 1043.2283 1055.9122 1079.7213 1099.3263 1103.3692 1123.0746 1136.7532 1146.0234 1174.3304 1194.6636 1209.5010 1212.2593 1221.6972 1244.5956 1269.8976 1271.6090 1274.4311 1287.4640 1294.5809 1300.3094 1311.5139 1336.5925 1349.0939 1349.8411 1354.1090 1361.3289 1367.9509 1370.0160 1386.8870 1388.1678 1390.0557 1453.1488 1455.3497 1456.5179 1456.7146 1463.8921 1466.3695 1470.8832 1475.8300 1477.1304 1477.9574 1479.5998 1484.0462 1486.2439 1486.4044 1490.9023 1671.9013 2948.3691 2948.5949 2968.9299 2970.6432 2972.4548 2973.0270 2975.4426 2976.3639 2983.5975 2991.1749 2994.5532 3000.7978 3022.1299 3036.1483 3038.6604 3044.0076 3064.7791 3069.5436 3069.7707 3071.2063 3073.2536 3073.4399 3076.8647 3077.1060 3106.2021 3545.5156 3576.5650
redmass: 3.5704 4.1489 3.0421 2.0888 2.7455 5.6302 2.4035 2.8671 3.0636 2.6389 2.5368 3.9167 2.7723 3.0285 3.1522 1.1686 1.1555 3.2590 1.2715 2.2970 2.4414 2.7668 2.9729 2.3972 3.0399 2.8608 2.3083 2.1712 1.2478 1.8179 1.4602 3.1496 4.9581 10.0842 1.1160 1.1466 1.6877 2.2733 1.9059 1.4052 2.2367 2.2700 2.0908 1.7888 2.0868 2.0433 1.7169 1.7676 3.4982 1.4972 2.2626 2.5351 1.9351 2.0087 2.2956 2.0810 3.1304 2.6205 1.9340 1.4618 2.0663 2.1419 1.4571 2.5839 1.5914 1.3612 1.2497 1.2104 1.3856 1.0626 1.2089 1.4143 1.2415 1.4083 1.2543 1.5266 1.4497 1.3263 1.3211 1.2164 1.2086 1.2154 1.2102 1.0788 1.0860 1.0868 1.1029 1.0773 1.0731 1.0674 1.0715 1.0445 1.0590 1.0513 1.0905 1.0675 1.0776 1.6433 8.6510 1.0587 1.0599 1.0592 1.0370 1.0535 1.0363 1.0447 1.0610 1.0606 1.0925 1.0712 1.0959 1.1017 1.0575 1.1011 1.1014 1.1002 1.1007 1.1005 1.0990 1.1002 1.0993 1.1002 1.0999 1.1076 1.0657 1.0772
irintensity: 0.0534 0.4415 0.4008 1.1771 1.1087 6.2635 2.7257 2.2923 0.2582 1.2455 0.7647 0.6795 1.2557 4.4916 1.9557 0.0837 0.0220 2.1629 1.9666 6.2384 5.2374 6.8767 1.6407 23.0719 2.6251 3.1653 5.4586 9.8623 93.7626 27.0066 125.4113 10.2732 9.1648 18.2814 14.0289 11.4797 6.6685 2.9809 14.6413 1.0513 0.3673 5.9272 1.8805 27.6485 0.6253 14.2861 50.6805 36.8336 78.9059 16.9406 138.4015 6.1676 20.7225 4.6113 6.6532 11.9916 60.5196 63.5604 4.1221 16.2736 4.4215 191.9234 9.5972 1.5827 4.9166 39.7370 1.2565 5.7472 10.9116 0.4267 40.1369 5.6982 3.3953 6.7402 16.1517 2.0489 4.7961 5.3853 2.6659 14.8523 8.8096 10.5331 17.3738 3.9975 24.3918 11.6952 13.1755 1.5904 3.3952 4.9828 3.1353 14.9199 19.1144 2.9248 18.6039 15.9990 30.0273 286.7461 281.8472 16.3639 18.0499 20.6636 26.2288 76.9675 36.4955 16.6257 62.7766 36.6240 16.9988 26.3450 26.6106 4.3026 31.9245 8.6191 83.1402 16.3986 66.7990 69.2926 70.4488 66.5657 45.1890 34.5265 9.9724 8.1375 9.7932 27.9336
temp: 298.150 k
press: 1.00000 atm
elementType: 8 8 8 7 6 6 6 6 6 6 6 6 6 6 6 6 6 1 1 1 1 1 1 1 1 1 1 1 1 1 1 1 1 1 1 1 1 1 1 1 1 1 1 1
symmnumber: 1
zpe: 1018815.2 jmol-1
zpe.correction: 0.388046 hartree
zpe.thermalcorrener: 0.408962 hartree
zpe.thermalcorrenthalpy: 0.409906 hartree
zpe.thermalcorrgfe: 0.336232 hartree
zpe.sumelectzpe: -790.601674 hartree
zpe.sumelectthermal: -790.580759 hartree
zpe.sumelectthermalent: -790.579815 hartree
zpe.sumelectthermalfe: -790.653488 hartree
dipole: 2.7764 0.0683 -0.1276
dipole: 2.7801
quadrupole: -98.6555 -117.6868 -107.7962
quadrupole: -6.5799 2.8058 -6.9478
quadrupole: 9.3907 -9.6406 0.2499 -6.5799 2.8058 -6.9478
hfenergy: -790.9897206 hartree
pointgroup: C01 [X(C13H27N1O3)]
dipole: -1.0792715 -0.0357192 -0.1740196 debye
polarizability: 183.0098555|-1.8274149|142.793857|3.0657707|-5.8288615|151.4867332 unknown
InChI: InChI=1S/C13H27NO3/c1-4-6-7-9-14-12(16)17-11-13(3,10-15)8-5-2/h14-15H,4-11H2,1-3H3
charge 0 multiplicity 1
44 atoms
O  0.86329 1.383499 -0.101494
O  2.636558 1.054899 -2.459853
O  -0.015215 0.750751 2.003887
N  -1.381612 1.510336 0.249043
C  2.769004 -0.245365 -0.283986
C  2.114148 -1.51466 0.3396
C  2.245383 1.059897 0.361687
C  2.420281 -0.244241 -1.806498
C  4.310743 -0.242022 -0.112736
C  2.45155 -1.811821 1.818473
C  1.744733 -3.089322 2.322637
C  -3.427547 0.06709 0.596413
C  -2.662751 1.36123 0.960622
C  -3.875147 -0.005173 -0.880523
C  -0.183353 1.171215 0.829782
C  -4.666845 -1.292595 -1.207123
C  -5.120376 -1.364199 -2.681015
H  2.411917 -2.390409 -0.276958
H  1.011669 -1.430416 0.243071
H  2.852431 1.919886 0.034476
H  2.239196 0.997678 1.462315
H  3.085504 -0.945037 -2.340268
H  1.370415 -0.574675 -1.94637
H  4.613337 -0.036751 0.93081
H  4.732576 -1.223636 -0.397445
H  4.76192 0.529681 -0.762923
H  3.546187 -1.926164 1.942219
H  2.135285 -0.959346 2.449208
H  0.645814 -2.980064 2.259414
H  2.000922 -3.300221 3.377159
H  2.033531 -3.972135 1.720448
H  1.912159 1.660178 -2.155307
H  -4.319875 0.003326 1.252401
H  -2.790468 -0.805287 0.841619
H  -4.503386 0.879131 -1.120524
H  -2.987207 0.04697 -1.544909
H  -3.290225 2.246107 0.737648
H  -2.432234 1.36972 2.039803
H  -1.36573 1.827834 -0.720122
H  -5.5526 -1.352205 -0.542248
H  -4.039127 -2.174774 -0.967542
H  -5.776851 -0.510942 -2.936481
H  -4.251889 -1.335863 -3.365924
H  -5.681115 -2.294404 -2.886285
