program: Gaussian 09
title: 000212846
version: EM64L-G09RevD.01
frameworkgroup: C1[X(C7H12N2O)]
method: RPBEPBE
basis: SDD
operation: Freq
keyword: #p
keyword: freq=noraman
keyword: PBEPBE/SDD
title: #p freq=noraman PBEPBE/SDD
converged: YES YES NO NO
title: Mulliken charges:
elementType: O N N C C C C C C C H H H H H H H H H H H H
charge: -0.460952 -0.435200 -0.031015 0.299977 -0.537355 -0.744231 -0.707331 0.413584 -0.480211 -0.320766 0.241321 0.206783 0.200999 0.234584 0.242769 0.236149 0.231637 0.198490 0.346435 0.278958 0.327215 0.258159
chargesum: 0.00000
title: Mulliken charges with hydrogens summed into heavy atoms:
elementType: O N N C C C C C C C
charge: -0.114517 -0.107985 -0.031015 0.299977 -0.089251 -0.065879 -0.041055 0.413584 -0.201252 -0.062607
polarizability: 1.11865854e+02 2.92132286e+00 8.68642573e+01 -1.00452637e+01 -2.15408911e+00 6.73746759e+01
1716.lowfreq: -10.7545 0.0005 0.0007 0.0007 3.8882 6.4483 53.5853 73.0057 100.3694
frequency: 53.5234 72.9902 100.3617 178.1984 235.2822 264.4330 284.7749 304.2007 345.3558 385.3776 404.0228 426.1945 494.5538 602.7136 641.1737 661.0495 737.8799 751.4430 812.6848 861.1205 864.7586 877.5955 898.7449 927.9164 953.5068 993.3068 1006.4901 1039.9011 1059.6403 1092.4211 1116.6998 1199.7678 1203.2246 1242.6803 1263.6945 1291.5922 1317.2359 1348.9437 1378.8715 1390.3337 1394.4856 1435.8799 1445.4344 1457.7618 1467.6126 1473.0016 1486.7594 1548.8920 2975.7542 2990.3185 2994.2961 3060.1109 3067.6541 3089.6447 3093.7889 3100.2913 3220.4203 3241.3672 3500.4850 3608.1218
redmass: 3.8790 3.2743 4.6611 1.0349 1.1747 3.3920 3.0078 3.3388 2.0536 2.1414 1.0892 2.8695 2.9604 2.1510 3.7681 1.8378 4.1610 4.0362 1.2315 2.3559 1.5663 1.7803 5.3625 1.4438 1.9114 1.4522 2.7951 1.3916 3.9943 1.4957 1.4896 2.3193 1.9989 2.0493 1.4352 2.6783 1.8406 1.7376 1.3130 2.2516 1.2394 3.7860 1.1049 1.0836 1.0573 1.0622 1.0559 4.0128 1.0368 1.0489 1.0477 1.0999 1.0993 1.0992 1.0997 1.0995 1.0928 1.1049 1.0653 1.0821
irintensity: 1.3314 2.2461 0.8028 0.6024 1.1469 0.4271 0.3048 0.6143 3.1632 0.5283 176.9107 10.0095 14.9674 32.2056 1.1671 71.4620 3.3757 13.5687 60.4977 15.9367 1.5169 5.6529 17.2754 1.9690 14.3393 1.3794 8.4596 9.3282 15.0607 10.2395 46.8068 24.3590 28.3100 42.7763 10.8035 16.4590 2.7470 33.8883 40.5652 9.4268 19.3058 4.4269 1.5244 7.1925 4.2034 4.6479 18.2481 21.7413 19.6462 5.1929 42.7337 8.6599 31.1294 9.6642 37.3015 36.9603 4.0530 1.0584 5.7563 52.5499
temp: 298.150 k
press: 1.00000 atm
elementType: 8 7 7 6 6 6 6 6 6 6 1 1 1 1 1 1 1 1 1 1 1 1
symmnumber: 1
zpe: 482912.9 jmol-1
zpe.correction: 0.183932 hartree
zpe.thermalcorrener: 0.194407 hartree
zpe.thermalcorrenthalpy: 0.195351 hartree
zpe.thermalcorrgfe: 0.148053 hartree
zpe.sumelectzpe: -457.871046 hartree
zpe.sumelectthermal: -457.860571 hartree
zpe.sumelectthermalent: -457.859627 hartree
zpe.sumelectthermalfe: -457.906925 hartree
dipole: 1.4445 1.4068 -1.2677
dipole: 2.3817
quadrupole: -70.4480 -57.6765 -61.1951
quadrupole: 8.1695 -2.3881 -1.4452
quadrupole: -7.3415 5.4300 1.9115 8.1695 -2.3881 -1.4452
hfenergy: -458.0549781 hartree
pointgroup: C01 [X(C7H12N2O1)]
dipole: 0.5549354 0.4957504 -0.5694838 debye
dipolederiv: -0.4095177 -0.1336181 -0.0885523 -0.1388731 -0.6601661 0.094638 -0.1474235 0.1107427 -0.6616102 -0.1234668 -0.1486994 -0.012393 -0.1572034 -0.4193978 0.0864714 -0.0368092 0.0972612 -0.2152474 -0.3064537 0.2341486 -0.0556849 0.2218961 -0.2024433 -0.075119 0.0034492 -0.0906561 -0.1713512 0.474509 0.0851904 0.0235478 0.0797541 0.5305197 -0.0430809 0.2008679 -0.0512441 0.4959946 -0.1275948 0.0382916 -0.0571274 -0.028756 0.0551253 -0.0314492 -0.128438 -0.0177261 0.0474504 -0.0449146 0.0322533 -0.0045574 0.0042714 -0.129494 -0.0741834 -0.0348619 -0.1459878 -0.0734277 -0.141976 -0.0027999 0.0736628 0.0381088 0.0407413 -0.0433795 -0.0370969 -0.018761 0.0241778 0.1144273 -0.0372978 -0.0363979 0.0972656 0.3578108 -0.1042285 -0.1656565 -0.069924 -0.0681595 -0.2856257 -0.0546646 -0.0042139 -0.0725675 -0.1147556 0.0161175 0.0058336 0.0415624 -0.2603467 0.2347603 -0.0078247 -0.1428109 -0.0912518 0.0436815 0.0005444 -0.1364958 -0.0424034 -0.065395 0.0220225 0.0077743 0.0241174 0.0261282 -0.0412795 -0.1182594 0.0374164 -0.0667758 0.0196454 0.0247893 0.0025136 0.0064177 -0.0313903 -0.0572329 0.1452128 0.0452686 0.0949381 -0.0104961 0.0939708 -0.0185084 0.0146045 -0.0261129 -0.0869803 0.0923433 0.0342041 0.1373088 -0.0107944 -0.0888109 0.0401808 0.1173323 0.0259768 0.0593489 -0.002653 0.1223369 -0.0053808 0.0479379 -0.0369689 -0.0313164 -0.1318135 0.0008251 0.0834875 -0.00068 -0.1258418 -0.0317812 -0.0154969 -0.0758153 -0.0110432 -0.0798967 -0.0089201 0.1048934 -0.0166768 -0.1342443 -0.0084157 -0.0194613 0.089193 -0.0127351 0.0079613 0.0372307 -0.0791259 -0.1214934 0.0343074 -0.1066234 0.027655 0.0809025 0.0061071 0.0061786 -0.0435949 -0.0512246 0.1346534 0.0498675 0.1102822 -0.0110491 0.1626703 0.0293564 0.1691587 0.0627521 0.2599347 0.0032664 0.2213914 -0.0003224 0.3112589 0.1204122 0.0676583 0.0261469 0.0633354 0.0014048 0.0122383 0.03644 0.0014532 0.1828349 0.2147425 -0.0306888 0.0692304 -0.02207 0.2223007 0.0124949 0.0753452 0.020826 0.2865143 0.0087444 -0.0542779 0.0750892 -0.0368046 0.0828514 0.0332228 0.0801397 0.0416272 0.1393664 unknown
polarizability: 111.4578605|1.8272794|86.1324958|-11.0672956|-4.4351889|68.5144305 unknown
InChI: InChI=1S/C7H12N2O/c1-7(2,10)5-6-3-4-8-9-6/h3-4,9-10H,5H2,1-2H3
charge 0 multiplicity 1
22 atoms
O  1.685167 -1.118607 0.956406
N  -1.527574 1.018971 -0.378579
N  -2.763953 0.745998 0.198648
C  1.803498 0.046542 0.049213
C  0.689616 -0.042566 -1.055247
C  1.695953 1.353243 0.866788
C  3.19139 -0.104644 -0.593807
C  -0.708518 -0.095084 -0.501863
C  -1.457107 -1.163749 0.034723
C  -2.704543 -0.597991 0.446482
H  0.877538 -0.963961 -1.634941
H  0.803369 0.812845 -1.74964
H  1.848986 2.243827 0.228152
H  0.708266 1.443063 1.355799
H  2.467542 1.357607 1.655684
H  3.970659 -0.079683 0.186816
H  3.266059 -1.072542 -1.118828
H  3.386112 0.709958 -1.314417
H  0.779254 -1.102044 1.366629
H  -1.152716 -2.207322 0.075187
H  -1.326313 1.974636 -0.666762
H  -3.561984 -1.089098 0.902857
