program: Gaussian 09
title: 000212873
version: EM64L-G09RevD.01
frameworkgroup: C1[X(C17H29NO2)]
method: RPBEPBE
basis: SDD
operation: Freq
keyword: #p
keyword: freq=noraman
keyword: PBEPBE/SDD
title: #p freq=noraman PBEPBE/SDD
converged: NO YES NO NO
title: Mulliken charges:
elementType: O O N C C C C C C C C C C C C C C C C C H H H H H H H H H H H H H H H H H H H H H H H H H H H H H
charge: -0.270366 -0.229785 -0.111535 0.280481 -0.098803 -0.098842 -0.098826 -0.534377 -0.529573 -0.526147 -0.447809 -0.448718 -0.450717 0.143292 -0.307424 -0.367389 -0.326450 -0.337331 -0.672593 -0.670012 0.199232 0.199171 0.200389 0.225169 0.215674 0.201395 0.231985 0.227299 0.207198 0.195028 0.195850 0.196185 0.196278 0.196788 0.196751 0.237866 0.228827 0.237039 0.213981 0.206948 0.188836 0.231426 0.190570 0.207309 0.227890 0.208470 0.208562 0.225263 0.205541
chargesum: 0.00000
title: Mulliken charges with hydrogens summed into heavy atoms:
elementType: O O N C C C C C C C C C C C C C C C C C
charge: -0.270366 -0.229785 -0.111535 0.280481 0.100429 0.100329 0.101563 -0.093534 -0.096193 -0.091650 -0.056931 -0.056254 -0.057177 0.143292 0.159269 0.083631 0.069334 0.084665 -0.028923 -0.030646
polarizability: 2.27908373e+02 -2.40351549e-01 1.78062672e+02 8.66029503e-01 1.99125977e+00 1.59575087e+02
1716.lowfreq: -46.0659 -13.7283 -3.7787 -0.0003 0.0004 0.0009 10.0403 14.2320 24.8334
frequency: -30.6919 12.8219 23.5525 49.1679 67.3249 77.4866 87.0664 114.6020 141.5366 181.7358 202.6132 228.3899 256.3504 274.2722 291.0142 295.0933 298.3755 317.9226 332.9533 369.5652 386.6266 392.8782 398.8965 416.4919 419.6039 440.0911 457.8632 470.1248 514.6531 636.1509 641.3048 661.8987 695.8959 718.5966 745.7276 761.8643 792.0276 794.2377 801.1875 806.7310 808.0525 852.6842 866.2979 872.9968 877.0676 910.7326 922.8984 936.3634 942.9120 965.2121 974.7949 978.2685 988.7429 1028.5234 1037.1668 1049.1878 1052.1215 1054.4737 1069.2519 1076.2553 1080.0841 1084.9888 1100.0906 1101.3058 1104.7810 1108.5056 1113.0236 1126.4523 1172.7447 1178.5783 1180.7090 1194.5310 1207.0748 1247.3685 1249.5866 1263.4034 1280.2230 1281.3600 1288.8841 1290.3448 1291.2630 1298.4162 1304.3740 1312.1705 1313.5250 1324.8106 1325.7111 1340.0769 1342.9587 1351.0357 1355.0281 1359.9771 1362.1084 1370.6379 1381.1154 1385.0205 1387.5132 1444.6625 1450.4693 1453.0996 1461.5277 1461.9115 1463.0741 1464.0095 1466.7894 1472.0678 1479.6746 1484.2438 1485.1712 1488.3679 1491.5988 1612.5563 2854.6816 2867.8744 2914.7055 2962.5963 2964.2062 2965.6647 2973.7202 2976.1140 2981.1106 2982.2908 2984.7955 2994.3672 2997.3852 3008.3909 3019.7728 3022.1033 3028.6615 3029.5342 3032.3326 3037.2235 3041.9120 3049.0846 3050.8123 3053.8353 3073.2232 3075.2346 3090.0293 3091.2933 3125.3572
redmass: 3.4892 3.9042 3.9445 5.5428 2.6969 2.1293 3.4712 3.0493 2.7919 1.6109 1.3485 2.2994 2.2721 1.9287 1.9685 2.2714 2.8008 2.3019 3.9314 3.2695 3.6879 4.5986 3.0904 1.7389 1.9299 2.3031 1.9892 3.0516 3.8275 3.8293 3.8355 4.1460 7.9381 3.3247 2.8214 3.5673 1.2636 1.1494 1.5902 2.5838 2.2889 3.6330 1.6099 1.5738 1.5570 2.5295 2.9073 2.1598 2.3007 2.3115 2.2242 2.3418 2.2392 6.0145 1.9199 1.7374 1.9904 2.6411 1.9016 2.2588 2.3496 2.1929 1.4647 1.4550 1.3367 1.0387 1.0219 1.7319 2.4225 1.2369 1.7510 1.5614 2.2577 1.4155 1.4830 1.7330 1.1467 1.7563 1.8479 1.1898 1.8387 1.1967 1.9975 1.5095 1.6350 1.3151 1.3211 1.4579 1.4604 1.4254 1.5508 1.5705 1.3341 1.3212 1.3387 1.2358 1.2578 1.0933 1.0830 1.0824 1.0524 1.0909 1.0562 1.0890 1.0915 1.0529 1.0471 1.0898 1.0735 1.0720 1.0804 10.6008 1.0720 1.0713 1.0698 1.0625 1.0632 1.0611 1.0634 1.0630 1.0358 1.0355 1.0658 1.0819 1.0801 1.0816 1.1030 1.1029 1.0881 1.1022 1.0880 1.0608 1.1016 1.1013 1.1006 1.0889 1.0987 1.0980 1.1003 1.1003 1.1076
irintensity: 0.1279 0.3787 0.2555 0.8893 0.3854 0.2743 0.3983 0.1467 0.8698 1.5554 0.1080 0.8782 6.2188 0.6743 0.0599 0.0303 3.5900 1.3058 11.7047 1.0786 1.7030 0.1169 7.7154 0.0584 0.7506 5.6801 2.2087 5.7638 7.7501 0.0434 0.2994 5.9266 5.0943 5.7918 3.4095 2.4090 7.5531 3.5722 5.7424 1.5410 2.8940 8.4237 0.3342 0.7358 0.1141 7.3840 20.5770 0.1490 30.3459 6.8698 10.8517 0.8421 3.0377 187.5781 1.9150 0.0185 3.3462 28.1833 61.8430 13.7081 21.1540 3.8597 5.8029 6.9088 3.1530 0.6900 0.0588 3.7965 165.1592 0.7666 16.3934 81.9234 30.7588 19.9170 0.1465 2.7212 1.9763 0.0745 0.0898 18.1220 0.6625 11.1806 2.7885 0.8300 0.4733 0.0808 4.8011 2.5620 3.5788 1.7584 0.3412 0.5310 6.3067 3.6071 2.6679 21.6172 20.3171 11.6399 0.2961 1.1721 5.6315 17.0815 4.7902 14.5154 27.2300 1.0910 3.3624 1.8795 11.6411 12.3810 9.8560 153.3114 58.3713 129.4897 71.7637 26.1457 21.8848 22.9039 8.5822 28.6542 36.4896 27.8486 41.2264 163.3217 131.8120 46.3256 16.6350 12.0847 4.5161 100.3063 19.9350 26.2655 2.5288 46.8520 40.1437 21.8881 33.3817 84.0540 38.6430 44.0316 15.1012
temp: 298.150 k
press: 1.00000 atm
elementType: 8 8 7 6 6 6 6 6 6 6 6 6 6 6 6 6 6 6 6 6 1 1 1 1 1 1 1 1 1 1 1 1 1 1 1 1 1 1 1 1 1 1 1 1 1 1 1 1 1
symmnumber: 1
zpe: 1140794.9 jmol-1
zpe.correction: 0.434506 hartree
zpe.thermalcorrener: 0.453837 hartree
zpe.thermalcorrenthalpy: 0.454781 hartree
zpe.thermalcorrgfe: 0.385490 hartree
zpe.sumelectzpe: -868.816955 hartree
zpe.sumelectthermal: -868.797625 hartree
zpe.sumelectthermalent: -868.796680 hartree
zpe.sumelectthermalfe: -868.865971 hartree
dipole: -0.2074 1.5379 -0.3330
dipole: 1.5872
quadrupole: -112.6668 -125.9916 -122.1844
quadrupole: 1.2706 -3.0057 -1.8493
quadrupole: 7.6142 -5.7107 -1.9035 1.2706 -3.0057 -1.8493
hfenergy: -869.2514613 hartree
pointgroup: C01 [X(C17H29N1O2)]
dipole: -0.0691931 -0.5409954 0.3040974 debye
polarizability: 227.8792742|0.9798817|177.594868|-1.1473491|-3.5916527|160.0719893 unknown
InChI: InChI=1S/C17H29NO2/c1-3-18(4-2)5-6-20-16(19)17-10-13-7-14(11-17)9-15(8-13)12-17/h13-15H,3-12H2,1-2H3
charge 0 multiplicity 1
49 atoms
O  0.651044 -0.698623 -0.646255
O  0.412207 1.59166 -0.307485
N  4.312579 -0.079399 0.107743
C  -1.568385 0.106333 -0.094782
C  -3.820529 1.046708 0.618949
C  -3.212728 -1.343585 1.204063
C  -3.713711 -0.715501 -1.201193
C  -2.321898 1.376213 0.39194
C  -1.710587 -1.023275 0.976693
C  -2.212791 -0.3935 -1.432923
C  -3.952217 -0.06826 1.691766
C  -4.452695 0.560543 -0.713143
C  -3.844848 -1.830189 -0.128182
C  -0.098465 0.445229 -0.339511
C  2.103851 -0.479059 -0.916063
C  2.905529 -0.443943 0.399591
C  5.306096 -0.781984 0.961211
C  4.517283 1.396551 0.056506
C  5.474511 -2.267502 0.590153
C  5.677009 1.810533 -0.868687
H  -4.342133 1.960489 0.965558
H  -3.297312 -2.14078 1.969014
H  -4.156462 -1.062536 -2.155888
H  -2.209995 2.184114 -0.355253
H  -1.861472 1.745901 1.328405
H  -1.245445 -0.693432 1.927452
H  -1.168253 -1.924873 0.637943
H  -1.673462 -1.291844 -1.787616
H  -2.108777 0.389641 -2.2103
H  -3.522283 0.277412 2.653459
H  -5.021668 -0.296581 1.873778
H  -5.529078 0.340522 -0.56588
H  -4.382395 1.357899 -1.480114
H  -3.338573 -2.753569 -0.474291
H  -4.913374 -2.079388 0.028909
H  2.404529 -1.331769 -1.542923
H  2.224758 0.467147 -1.471023
H  2.422513 0.271008 1.104884
H  2.868844 -1.442403 0.869287
H  6.278648 -0.274692 0.825364
H  5.050792 -0.689357 2.047746
H  3.581634 1.855072 -0.313325
H  4.68253 1.813146 1.081921
H  6.236065 -2.743112 1.236129
H  5.792409 -2.362463 -0.462693
H  4.532598 -2.832486 0.714052
H  5.776832 2.911898 -0.891441
H  5.491556 1.450061 -1.895508
H  6.643917 1.393926 -0.532135
