program: Gaussian 09
title: 000212832
version: EM64L-G09RevD.01
frameworkgroup: C1[X(C9H11N3O2)]
method: RPBEPBE
basis: SDD
operation: Freq
keyword: #p
keyword: freq=noraman
keyword: PBEPBE/SDD
title: #p freq=noraman PBEPBE/SDD
converged: YES YES NO NO
title: Mulliken charges:
elementType: O O N N N C C C C C C C C C H H H H H H H H H H H
charge: -0.332513 -0.278399 -0.367810 -0.634834 -0.641006 0.224141 0.391527 -0.320762 -0.397385 -0.821997 -0.233472 -0.229856 0.281123 0.258917 0.257109 0.236431 0.277360 0.231235 0.220825 0.233877 0.229864 0.352098 0.344433 0.331732 0.387363
chargesum: 0.00000
title: Mulliken charges with hydrogens summed into heavy atoms:
elementType: O O N N N C C C C C C C C C
charge: -0.332513 -0.278399 -0.367810 0.061697 0.078090 0.224141 0.391527 -0.063653 -0.160954 -0.092577 0.000404 0.000008 0.281123 0.258917
polarizability: 1.56937547e+02 -9.30557563e-01 1.05342689e+02 3.42921593e+00 -8.18673832e+00 9.88149408e+01
1716.lowfreq: -9.6078 -0.0008 -0.0007 -0.0005 3.2663 8.9335 38.8248 65.2191 86.3351
frequency: 38.8147 65.2069 86.3332 104.0617 122.2218 130.8475 183.7544 225.2879 303.4982 316.2525 376.3903 415.7092 424.2014 451.5208 462.1585 505.3132 517.6813 538.6853 549.1016 575.6906 588.6124 632.4639 681.6852 702.5047 725.1026 733.0834 769.2477 791.5979 798.6937 872.2898 948.5103 957.9628 987.1597 990.7729 1037.8834 1043.2240 1048.8308 1070.7056 1109.1889 1124.7058 1173.3572 1203.2081 1260.6373 1281.3115 1326.6136 1371.8182 1384.8406 1397.4618 1433.1855 1463.6376 1478.3253 1486.4677 1521.7606 1579.3116 1588.5547 1612.1217 1636.6766 1674.4045 2982.2219 3063.9324 3090.9656 3125.1210 3136.9019 3148.5416 3167.2244 3321.1744 3535.6525 3644.0246 3690.9795
redmass: 4.5846 5.3885 5.1299 6.0342 5.4771 1.1000 2.7839 5.7838 4.0002 3.4451 4.4902 5.7100 4.6286 3.1459 3.1022 1.1826 3.7042 1.6804 1.5126 1.5361 3.9166 4.3431 4.4106 7.9831 2.9287 6.0842 1.4203 4.6210 1.1439 1.2963 1.3794 4.8321 1.6364 1.3313 2.7450 2.0515 1.7510 2.1560 2.2593 1.9483 1.0604 2.6549 3.4597 1.4756 2.5964 8.0060 4.5064 1.2314 2.1015 1.0639 1.3815 1.9408 1.9542 1.1984 6.1311 6.3958 2.5266 7.8481 1.0369 1.0971 1.0997 1.0865 1.0888 1.0947 1.1009 1.0621 1.0450 1.0908 1.1048
irintensity: 0.2180 0.0246 0.9467 8.9200 0.3927 1.2312 1.9802 8.9979 2.2174 11.1819 14.2493 2.8646 6.4677 5.1673 6.8033 137.4433 10.3849 37.8339 18.6889 170.5634 32.6188 16.2582 0.4510 3.7384 26.0221 19.9467 38.0532 1.8339 166.4314 1.0677 0.7047 4.6622 0.8685 0.1314 20.3219 8.1502 3.0214 35.8193 9.0793 6.1296 0.8783 3.9742 7.6680 0.9025 395.9824 11.4915 219.9695 15.9447 2.0576 24.6677 15.2035 41.1717 504.9317 230.7249 2.2797 3.2142 52.1748 426.8260 17.7194 9.2808 20.5148 4.9678 4.9437 24.9392 20.2183 174.3747 43.9758 84.4353 64.3358
temp: 298.150 k
press: 1.00000 atm
elementType: 8 8 7 7 7 6 6 6 6 6 6 6 6 6 1 1 1 1 1 1 1 1 1 1 1
symmnumber: 1
zpe: 513122.5 jmol-1
zpe.correction: 0.195438 hartree
zpe.thermalcorrener: 0.208660 hartree
zpe.thermalcorrenthalpy: 0.209604 hartree
zpe.thermalcorrgfe: 0.155418 hartree
zpe.sumelectzpe: -663.292590 hartree
zpe.sumelectthermal: -663.279369 hartree
zpe.sumelectthermalent: -663.278424 hartree
zpe.sumelectthermalfe: -663.332610 hartree
dipole: -2.0919 2.8614 1.4745
dipole: 3.8390
quadrupole: -75.8131 -81.3339 -79.0713
quadrupole: -6.6380 -2.2075 -3.9833
quadrupole: 2.9263 -2.5945 -0.3318 -6.6380 -2.2075 -3.9833
hfenergy: -663.4880283 hartree
pointgroup: C01 [X(C9H11N3O2)]
dipole: -0.6394914 1.3681384 -0.0223324 debye
dipolederiv: -1.3164037 0.0609505 0.1657824 -0.0288554 -0.725497 0.0728937 0.1691148 0.0526898 -0.4196952 -0.8141292 -0.1555729 0.1235501 -0.1929831 -0.9650822 0.1621807 0.1572244 0.144089 -0.4055388 -0.7775062 -0.1650778 0.129874 -0.0754471 -1.4888333 0.2828496 0.1121329 0.3036886 -0.3029447 -0.4795366 0.3085958 -0.0657478 0.1924952 -1.1411207 0.0663717 -0.051501 0.0364715 -0.6254261 -1.2016431 0.1676561 0.0744396 0.2664833 -0.5613153 -0.0830505 0.0446851 -0.0587769 -0.6487259 0.6258945 -0.0582717 -0.0802678 -0.2531467 -0.0240466 0.0524293 -0.1435673 0.0534342 0.0733209 0.0142842 -0.0051284 0.248304 -0.0578699 0.0162573 -0.080595 0.185388 -0.0360183 0.2136552 -0.0676808 -0.01433 -0.048292 0.0106285 -0.1213495 0.0504377 0.0061606 0.0134532 -0.004814 -0.0854974 -0.0195039 -0.2232355 0.0033924 -0.1606981 0.0249829 -0.0755932 0.0194585 0.0034985 -0.045782 0.0181094 -0.159017 0.0522268 0.0076254 0.0961585 -0.0992591 0.0284925 -0.0624891 -0.0530774 -0.0047689 0.1200963 0.0106373 -0.1616222 0.0001915 0.0845919 -0.0004825 0.0065134 0.1177265 -0.0417485 -0.0059334 -0.0314026 -0.1352765 0.0093095 -0.0376868 0.0157266 0.0350413 1.6460884 0.0964554 -0.2838423 0.2440246 1.7820184 -0.321834 -0.3243854 -0.2886147 0.3997823 1.5812517 -0.314909 -0.1956293 -0.1988281 1.8195709 -0.2876682 -0.1663945 -0.3088413 0.36127 0.0599284 0.0153998 0.0777735 0.0132865 0.1361393 -0.0256714 0.0718539 -0.0211605 -0.0293457 0.0442113 0.0138634 0.0531577 0.0186194 0.1470095 -0.0190866 0.0883088 -0.0242733 -0.0860197 0.0789467 0.0457956 -0.0428992 0.0446075 -0.0340038 0.0495529 -0.0672893 0.0009798 0.0783654 -0.0568571 -0.096418 -0.027237 -0.1136801 0.0383801 -0.0172434 -0.0013247 0.0456567 0.0667147 0.0048107 0.0509764 0.1444782 0.0343622 0.0881255 -0.0835933 0.0536693 -0.0462637 -0.0720989 0.0052449 0.0136798 -0.0859585 0.0121516 0.1584259 0.001763 -0.1029793 0.0003023 -0.0488221 -0.125934 0.0391357 0.0096271 0.0409527 0.1500055 -0.0048098 0.0166556 -0.0068052 0.0861467 0.1876813 0.0173461 0.0088062 0.1137143 0.2479718 -0.013059 0.0076958 0.0221951 0.2999867 0.1559247 0.0153774 0.028756 0.0222781 0.2448487 0.0187993 0.0248769 0.0220487 0.3612264 0.2299369 -0.016674 0.0267521 -0.0288617 0.155775 0.0568294 0.0208122 0.0626866 0.3535356 0.2721173 0.029062 0.0066626 -0.0987857 0.5266919 -0.0081385 0.0268103 -0.0301367 0.3668632 unknown
polarizability: 155.7957513|-8.5464475|97.1485959|-3.6781405|-5.9268817|108.1508296 unknown
InChI: InChI=1S/C9H11N3O2/c1-6-4-2-3-5-7(6)12(8(10)13)9(11)14/h2-5H,10-11H2,1H3
charge 0 multiplicity 1
25 atoms
O  2.749482 0.743093 -0.792585
O  0.338544 -2.517935 0.327951
N  0.660678 -0.265434 -0.26952
N  0.845487 2.053189 -0.730591
N  2.495933 -1.801625 -0.213897
C  -0.778224 -0.075316 -0.122643
C  -1.351802 0.068393 1.171141
C  -1.575639 -0.0379 -1.28899
C  -2.753885 0.267773 1.246913
C  -0.50499 -0.024175 2.422795
C  -2.969725 0.161804 -1.190055
C  -3.558115 0.316698 0.086056
C  1.488917 0.837383 -0.611859
C  1.149505 -1.618009 -0.028846
H  -1.096577 -0.18098 -2.263799
H  -3.218616 0.376986 2.233918
H  -0.184549 -1.070686 2.582126
H  0.41262 0.587211 2.346491
H  -1.069622 0.303892 3.311724
H  -3.587103 0.184826 -2.094222
H  -4.639443 0.467711 0.177916
H  -0.15974 2.157756 -0.60862
H  1.424381 2.854052 -0.972756
H  2.859357 -2.737447 -0.04931
H  3.081029 -0.999761 -0.498737
