program: Gaussian 09
title: 000212771
version: EM64L-G09RevD.01
frameworkgroup: C1[X(C17H12Cl2N2O3)]
method: RPBEPBE
basis: SDD
operation: Freq
keyword: #p
keyword: freq=noraman
keyword: PBEPBE/SDD
title: #p freq=noraman PBEPBE/SDD
converged: YES YES NO NO
title: Mulliken charges:
elementType: Cl Cl O O O N N C C C C C C C C C C C C C C C C C H H H H H H H H H H H H
charge: -0.028499 -0.022519 -0.197201 -0.195584 -0.173338 -0.322514 -0.306821 0.273406 0.321776 -0.677360 0.138371 0.175727 0.417951 -0.268714 -0.276327 0.300630 -0.125558 -0.248667 -0.363507 -0.338563 -0.687072 -0.212727 -0.220380 -0.239867 0.297575 0.287777 0.298402 0.269515 0.267089 0.265250 0.272048 0.307802 0.307085 0.235810 0.233703 0.235296
chargesum: 0.00000
title: Mulliken charges with hydrogens summed into heavy atoms:
elementType: Cl Cl O O O N N C C C C C C C C C C C C C C C C C
charge: -0.028499 -0.022519 -0.197201 -0.195584 -0.173338 -0.322514 -0.306821 0.273406 0.321776 -0.092008 0.138371 0.175727 0.417951 0.029688 -0.006811 0.300630 -0.125558 0.018422 -0.098257 -0.066515 -0.072186 0.023083 0.013324 -0.004571
polarizability: 2.62729458e+02 -8.63158784e+00 2.31297293e+02 -9.72411726e+00 -1.75523871e+01 1.90057145e+02
1716.lowfreq: -4.8784 -0.0008 0.0014 0.0018 4.3327 8.0964 17.8026 33.1774 41.9578
frequency: 17.7386 33.1596 41.9376 50.2837 56.1103 66.5558 98.4164 110.8620 132.9961 140.1271 164.5523 200.2746 212.8301 237.7318 251.5284 259.3546 277.7978 304.9483 348.9012 363.6762 373.2173 405.2998 413.1391 438.6662 469.4960 480.9776 483.8245 511.6723 546.4824 553.0227 564.5371 602.2701 612.8858 630.4102 633.9904 666.2182 673.0701 695.4307 720.4572 735.1461 751.4837 760.3094 770.4848 811.6915 841.8967 873.5861 886.3107 908.0160 910.3070 918.9158 947.3012 956.3457 974.1234 975.9806 989.2461 993.9088 996.6620 1027.7366 1072.5277 1087.5835 1090.0208 1103.8275 1134.4348 1155.8878 1175.4248 1180.9246 1193.0616 1207.8045 1223.4919 1260.9557 1275.8356 1278.7327 1291.0706 1293.1939 1324.0722 1376.2286 1386.0078 1394.4075 1397.1443 1441.4278 1443.4409 1476.2838 1481.8533 1579.2302 1589.9345 1596.7917 1605.1979 1617.4732 1630.5896 1642.0633 3028.2477 3074.2787 3134.0462 3141.2403 3142.2077 3147.4550 3154.1651 3168.8625 3168.9188 3176.1511 3188.2133 3188.6296
redmass: 12.0201 8.7998 5.7924 6.4362 10.3483 7.1688 6.0854 7.5487 3.4848 8.2638 6.3090 6.2219 5.9973 9.5365 10.9244 7.8617 5.4955 7.9258 9.0451 9.4758 6.2203 2.8523 4.9755 4.0383 4.4482 6.2521 2.8633 3.9606 4.6539 4.0256 4.9464 4.9745 6.3303 6.3810 5.3872 6.9981 6.7282 2.0249 4.5618 6.7008 5.0628 3.5541 2.5093 1.4075 1.2505 1.5787 3.8050 2.7515 2.2839 1.6451 1.3669 3.3226 1.3868 5.7836 5.7461 4.0491 1.3472 2.1590 3.6844 1.7267 1.9763 1.7080 1.7560 1.1106 1.0524 1.9008 1.2668 2.6882 3.4831 1.6191 1.6072 1.6244 5.2229 1.9159 1.3825 8.1817 10.0657 1.2744 2.8814 1.1397 2.1115 2.7158 2.3154 8.2688 7.6413 6.6280 6.3010 8.2767 11.2101 10.9668 1.0649 1.0584 1.0855 1.0986 1.0894 1.1062 1.0945 1.0894 1.0992 1.0929 1.0979 1.0965
irintensity: 0.0164 1.5148 0.6180 0.3626 1.0625 0.9951 0.6722 3.3447 8.3171 1.6314 2.9901 1.0575 0.8692 1.0074 6.1837 4.7508 3.1211 1.0502 8.3077 3.6627 0.8900 0.7309 1.8946 2.3606 3.3758 15.4448 9.9186 27.0318 14.4314 1.7574 4.9483 12.0652 2.4733 10.8669 7.0536 28.5220 4.9109 29.2116 11.4760 69.1183 32.0371 75.9011 1.8522 22.1637 0.9468 10.1504 7.0583 4.4513 8.8832 3.3984 2.6786 1.8110 0.5084 30.0557 2.2196 10.6365 0.8343 8.6897 145.8445 27.2024 44.1487 8.6262 61.7927 0.6499 0.2198 33.1546 11.5090 119.9807 119.0538 15.6997 81.4366 33.8177 238.3264 64.1624 4.6774 7.3116 3.8862 35.9282 16.2614 35.3595 1.9771 130.5495 72.2148 22.1757 140.5715 8.9427 15.5386 180.1631 235.5160 233.9908 0.8219 10.9607 0.9294 0.1730 5.1647 0.0291 22.6211 2.2928 18.8455 0.3156 0.7076 1.2368
temp: 298.150 k
press: 1.00000 atm
elementType: 17 17 8 8 8 7 7 6 6 6 6 6 6 6 6 6 6 6 6 6 6 6 6 6 1 1 1 1 1 1 1 1 1 1 1 1
symmnumber: 1
zpe: 667478.2 jmol-1
zpe.correction: 0.254229 hartree
zpe.thermalcorrener: 0.274941 hartree
zpe.thermalcorrenthalpy: 0.275885 hartree
zpe.thermalcorrgfe: 0.202307 hartree
zpe.sumelectzpe: -1908.640891 hartree
zpe.sumelectthermal: -1908.620179 hartree
zpe.sumelectthermalent: -1908.619234 hartree
zpe.sumelectthermalfe: -1908.692812 hartree
dipole: 3.3614 2.0595 1.4288
dipole: 4.1931
quadrupole: -157.6937 -155.9285 -153.4126
quadrupole: -12.3257 -9.5191 12.4531
quadrupole: -2.0154 -0.2503 2.2657 -12.3257 -9.5191 12.4531
hfenergy: -1908.8951196 hartree
pointgroup: C01 [X(C17H12Cl2N2O3)]
dipole: -0.8885558 0.9381706 -1.025572 debye
polarizability: 264.2717366|-3.8097485|237.1582198|7.1906115|3.3727245|182.6539398 unknown
InChI: InChI=1S/C17H12Cl2N2O3/c18-10-17(24)21-13-7-6-11(19)8-14(13)20(15(22)9-16(21)23)12-4-2-1-3-5-12/h1-8H,9-10H2
charge 0 multiplicity 1
36 atoms
Cl -1.44707 4.580479 -1.478925
Cl 4.488741 -1.113475 3.006183
O  -1.086745 -2.773194 -1.326021
O  2.835459 -2.338021 -0.97383
O  2.688788 0.856139 1.706723
N  -0.933803 -0.547127 -0.582654
N  1.975902 -0.278434 -0.211442
C  -0.270213 0.726394 -0.690048
C  1.136067 0.861319 -0.539832
C  0.838909 -1.466815 -2.07993
C  -0.485279 -1.669018 -1.317748
C  1.988692 -1.415296 -1.079079
C  -2.14238 -0.613909 0.227649
C  -1.053742 1.874019 -0.981874
C  1.740042 2.131466 -0.6993
C  2.776938 -0.171173 1.002703
C  -0.428614 3.121449 -1.1088
C  0.967976 3.273638 -0.977137
C  -2.115964 -0.041166 1.523016
C  -3.321229 -1.224657 -0.261161
C  3.672372 -1.362631 1.346551
C  -3.274823 -0.073653 2.326649
C  -4.4728 -1.259735 0.555838
C  -4.457328 -0.683794 1.846765
H  0.990545 -2.347125 -2.718848
H  0.806224 -0.554054 -2.70126
H  -2.134856 1.771173 -1.103834
H  2.821712 2.228028 -0.576804
H  1.436651 4.254963 -1.084151
H  -1.195714 0.419739 1.897772
H  -3.333498 -1.680366 -1.25353
H  4.474141 -1.491344 0.606638
H  3.10606 -2.302911 1.403109
H  -3.249608 0.368857 3.328041
H  -5.383591 -1.737321 0.179192
H  -5.354859 -0.713045 2.473682
