program: Gaussian 09
title: 000212752
version: EM64L-G09RevD.01
frameworkgroup: C1[X(C11H9FN2O3)]
method: RPBEPBE
basis: SDD
operation: Freq
keyword: #p
keyword: freq=noraman
keyword: PBEPBE/SDD
title: #p freq=noraman PBEPBE/SDD
converged: YES YES NO NO
title: Mulliken charges:
elementType: F O O O N N C C C C C C C C C C C H H H H H H H H H
charge: -0.190235 -0.222751 -0.208895 -0.252741 -0.002338 0.005577 -0.463803 0.475536 0.027679 0.354465 -0.431472 -0.410412 0.259280 -0.457717 0.330780 -0.772026 -0.416596 0.236081 0.247232 0.292021 0.309701 0.260336 0.251821 0.260243 0.250933 0.267303
chargesum: 0.00000
title: Mulliken charges with hydrogens summed into heavy atoms:
elementType: F O O O N N C C C C C C C C C C C
charge: -0.190235 -0.222751 -0.208895 -0.252741 -0.002338 0.005577 0.019511 0.475536 0.027679 0.354465 -0.139451 -0.100711 0.259280 -0.197382 0.330780 -0.009029 -0.149293
polarizability: 1.83149485e+02 -5.43627826e+00 1.34129177e+02 -5.21557837e+00 1.07246756e+01 1.00607647e+02
1716.lowfreq: -82.5999 -2.0163 -0.0009 -0.0007 -0.0006 4.3995 9.3994 27.0109 27.2650
frequency: -82.5985 26.9823 27.1546 36.7519 68.3678 111.6665 126.9219 172.7419 217.0327 221.7389 244.4030 293.6755 311.5593 349.3934 389.5190 414.3265 460.4889 490.5533 509.8068 526.5070 592.7794 614.8526 626.8519 657.3164 701.0051 727.8485 742.4772 748.5368 838.2809 853.3968 868.0011 893.6327 909.7307 924.6135 931.3947 941.8431 961.4186 990.4348 991.9881 1007.6505 1040.1378 1078.0602 1132.2535 1145.5629 1166.4450 1230.3457 1236.8698 1253.8868 1313.3316 1318.2014 1351.3871 1382.3529 1404.8805 1423.5531 1430.6527 1442.7364 1458.0227 1463.3005 1469.9349 1554.7390 1587.6645 1590.6803 1613.3643 2998.5269 3041.3285 3082.1950 3113.3577 3122.1282 3135.0888 3157.1602 3173.8334 3256.6354
redmass: 1.0428 8.9330 5.7519 5.9671 9.3128 5.8756 5.8167 4.9998 6.9617 4.6504 5.2812 3.6808 4.6285 4.0449 5.8323 3.2035 5.5897 6.8653 8.0492 5.5572 10.0507 4.7340 5.8295 4.7542 3.8594 3.4204 5.6349 5.9891 13.0489 5.7418 1.3698 1.6877 3.7833 1.7208 1.4558 2.9568 6.6190 2.1282 1.8889 4.4759 1.4718 2.2038 2.4284 1.8901 4.2982 2.6952 1.2131 2.2272 1.2777 7.2262 1.3216 7.2510 1.2411 2.7665 4.5718 2.6009 1.1329 1.0437 1.1288 6.4451 7.9256 6.6341 10.6417 1.0371 1.0599 1.0984 1.0990 1.1063 1.0920 1.0934 1.0944 1.1003
irintensity: 0.0097 0.2364 1.7263 3.3994 3.5786 5.1318 1.1069 0.5383 8.0897 3.8645 0.2026 1.5019 3.8304 12.2637 3.3714 11.4681 0.4461 0.8890 11.3778 1.2799 2.1891 0.3668 1.4826 0.3808 20.7691 28.6814 12.6283 28.1277 38.1465 44.1331 30.8501 20.7907 2.1487 25.1827 2.0947 8.0159 112.7965 16.4067 1.9986 4.7596 7.6891 95.5859 5.0598 28.2875 249.9770 113.4759 19.6144 59.0773 1.5560 3.9865 10.6508 66.9673 18.5274 82.5737 33.4010 9.4313 31.9331 19.7485 14.4857 19.6904 70.2902 18.2015 124.8135 10.3267 24.9960 7.7298 3.9508 2.9817 14.0901 6.4958 4.5985 4.4012
temp: 298.150 k
press: 1.00000 atm
elementType: 9 8 8 8 7 7 6 6 6 6 6 6 6 6 6 6 6 1 1 1 1 1 1 1 1 1
symmnumber: 1
zpe: 482646.9 jmol-1
zpe.correction: 0.183830 hartree
zpe.thermalcorrener: 0.198224 hartree
zpe.thermalcorrenthalpy: 0.199169 hartree
zpe.thermalcorrgfe: 0.139641 hartree
zpe.sumelectzpe: -858.309937 hartree
zpe.sumelectthermal: -858.295543 hartree
zpe.sumelectthermalent: -858.294598 hartree
zpe.sumelectthermalfe: -858.354126 hartree
dipole: -3.0663 1.4632 1.7992
dipole: 3.8445
quadrupole: -83.6321 -99.4511 -99.5772
quadrupole: -14.3149 3.5973 -8.4750
quadrupole: 10.5880 -5.2310 -5.3571 -14.3149 3.5973 -8.4750
hfenergy: -858.493767 hartree
pointgroup: C01 [X(C11H9F1N2O3)]
dipole: -1.2363149 -0.1010677 -0.8655209 debye
dipolederiv: -0.2895134 0.1536695 0.1566589 0.2505867 -0.4996134 -0.4056511 0.2729245 -0.4317518 -0.6853215 -1.3772763 -0.30895 -0.209819 -0.6859924 -0.6091906 -0.1979566 -0.469601 -0.2463327 -0.5213868 -0.6692583 -0.207704 0.2022141 -0.3292733 -0.2667926 0.0814463 0.0773674 -0.0021636 -0.2934842 -0.7453558 -0.1308688 0.1499626 -0.2185625 -0.4076107 0.0033774 -0.0405481 -0.0453971 -0.8354914 0.2132213 0.1329871 -0.1656935 0.1069579 -0.0940229 -0.0875663 -0.3941316 -0.1804409 -0.0469805 -0.289873 0.0023001 0.0009922 0.0106447 -0.2363384 -0.0177145 -0.0567113 0.0041013 -0.2713763 1.006161 0.0538653 0.0689763 0.1777701 0.4730757 0.0321547 -0.1001771 -0.0353943 0.2029333 0.0259751 -0.0728164 -0.0409824 0.0097384 -0.1346045 0.0037211 0.0733213 -0.031804 -0.0472758 -0.1704012 -0.071454 0.1628337 -0.0264372 0.0718804 0.0732558 0.4701446 0.2366563 -0.0557244 0.5181391 0.2724413 -0.0328953 0.3012552 0.2483315 0.0373153 -0.0270378 0.0328813 0.257196 -0.4503656 -0.1501661 -0.0413592 -0.1362369 -0.2632229 0.0134177 0.11629 0.0835025 -0.0734145 -0.1150351 0.0344854 0.147081 -0.0019002 -0.1229461 -0.0665387 -0.0092056 0.0332976 -0.0709045 1.61918 0.5883597 -0.0871068 0.9363602 0.6919951 0.1524196 0.3619491 0.2217208 1.1608789 -0.0354905 -0.0304162 0.0173107 -0.0548249 0.0398007 0.0994489 -0.0129786 0.1938858 0.1826084 0.1833913 -0.1000289 -0.2055875 -0.2467621 0.5230294 0.4746059 -0.4346968 0.5324792 0.7270402 -0.1108738 -0.1104355 -0.0143749 -0.1440529 -0.0363004 -0.0266399 -0.0890554 -0.0708595 0.0062934 0.1585684 -0.2051461 -0.0420223 -0.0586365 0.0225454 0.0458889 0.2149305 -0.1364499 -0.0448034 -0.0070581 -0.0307672 -0.0170978 -0.0300525 -0.0006539 -0.0489758 0.0106536 -0.1366395 0.0292722 -0.046626 0.0190346 -0.0345817 -0.0104859 0.0634418 -0.0002069 0.0353421 0.1259378 -0.0242851 0.1812651 -0.0176288 0.019098 -0.0148684 0.1777521 -0.0332094 -0.0005966 -0.0446585 0.0601068 0.1892838 0.0186836 -0.0702545 0.0034512 0.1342684 -0.0102043 -0.0567411 -0.0217711 0.0827147 0.0965233 0.0694417 0.036717 0.0715274 0.0389751 -0.0862354 0.0420048 -0.088159 0.028523 0.0357815 0.0378416 0.0178162 -0.0224551 -0.0684904 -0.0495817 0.0210664 -0.0574771 0.1157253 0.0730487 -0.0275514 0.0405674 -0.0074555 0.1242483 -0.0238956 0.105555 0.0155724 -0.0245334 -0.0124776 -0.0206852 -0.0678245 0.0255168 0.0646666 0.0679656 -0.0978822 0.0607243 0.0282251 0.0190662 0.1015088 0.0093712 0.0941877 0.0657765 -0.0306409 -0.012186 -0.0114603 0.1134646 unknown
polarizability: 181.9732044|11.1151394|109.308871|3.0811054|17.9224615|126.6042338 unknown
InChI: InChI=1S/C11H9FN2O3/c1-7-2-10(14-17-7)11(15)16-6-8-3-9(12)5-13-4-8/h2-5H,6H2,1H3
charge 0 multiplicity 1
26 atoms
F  4.11131 -1.574259 -1.698287
O  -0.210816 1.125212 0.652057
O  -3.762185 -0.897987 1.470792
O  -0.505085 0.374865 -1.543884
N  -2.537774 -0.109036 1.442251
N  4.193787 0.129818 1.56711
C  1.046177 1.840691 0.228858
C  2.253233 0.932471 0.29123
C  -2.118736 -0.22074 0.150529
C  -4.006701 -1.43717 0.190783
C  -2.991752 -1.028891 -0.656853
C  2.59533 0.085885 -0.794282
C  -0.884245 0.438117 -0.347068
C  3.085875 0.917323 1.440178
C  3.734795 -0.71888 -0.649354
C  -5.234009 -2.280238 0.052727
C  4.515249 -0.687765 0.523906
H  1.11721 2.65797 0.962272
H  0.889899 2.240279 -0.787909
H  -2.856936 -1.254138 -1.710661
H  1.984815 0.050349 -1.701489
H  2.858163 1.558817 2.299474
H  -4.975544 -3.309028 -0.253977
H  -5.770972 -2.32899 1.013663
H  -5.91747 -1.86402 -0.70802
H  5.402887 -1.320454 0.627455
