program: Gaussian 09
title: 000212751
version: EM64L-G09RevD.01
frameworkgroup: C1[X(C17H26Cl2N2O)]
method: RPBEPBE
basis: SDD
operation: Freq
keyword: #p
keyword: freq=noraman
keyword: PBEPBE/SDD
title: #p freq=noraman PBEPBE/SDD
converged: YES YES NO NO
title: Mulliken charges:
elementType: Cl Cl O N N C C C C C C C C C C C C C C C C C H H H H H H H H H H H H H H H H H H H H H H H H H H
charge: -0.071731 -0.064130 -0.296287 -0.174868 -0.144580 -0.079999 0.011898 0.130581 -0.673950 -0.683899 -0.708056 -0.710715 0.295463 0.473353 -0.552757 -0.420419 -0.416033 -0.387636 -0.378019 -0.254573 -0.556137 -0.555784 0.253055 0.186356 0.211003 0.221173 0.218232 0.226874 0.213292 0.217319 0.204833 0.271913 0.218426 0.211827 0.207091 0.270155 0.258130 0.273631 0.248144 0.273796 0.233264 0.243104 0.224865 0.222644 0.293026 0.265285 0.289550 0.261289
chargesum: 0.00000
title: Mulliken charges with hydrogens summed into heavy atoms:
elementType: Cl Cl O N N C C C C C C C C C C C C C C C C C
charge: -0.071731 -0.064130 -0.296287 -0.174868 -0.144580 0.173056 0.198254 0.130581 -0.023542 -0.026414 -0.012884 -0.021642 0.295463 0.473353 -0.294626 0.101356 0.091027 -0.144533 -0.153154 -0.031930 0.002173 -0.004945
polarizability: 2.90077013e+02 4.31448220e+00 1.88347342e+02 -2.16130954e+00 1.85792588e+01 2.00652758e+02
1716.lowfreq: -4.5151 -0.0022 -0.0013 0.0010 3.3598 12.1567 21.9747 24.6749 36.7514
frequency: 21.7562 24.3794 36.7428 43.6421 49.6938 70.7108 87.8880 88.8865 97.8450 104.8439 121.2532 140.3247 145.9409 170.6889 177.7644 197.6469 202.0378 209.3993 215.5672 233.3266 237.0048 254.8770 265.4315 319.5564 335.8457 342.6448 368.6192 376.0977 394.0724 431.8894 439.8119 458.4923 481.7443 503.7866 517.6629 529.9886 548.0886 591.2470 600.5209 605.9149 624.6800 664.2410 697.6456 717.6835 739.9470 787.0889 824.9359 863.4694 869.3947 872.1585 881.0397 890.5146 914.8483 919.8718 921.9695 932.3690 938.0771 944.3479 948.6097 963.3643 978.1262 1006.0024 1022.3151 1037.6897 1050.8863 1094.8670 1106.1070 1129.6059 1147.5646 1149.8516 1160.4052 1161.3885 1169.4712 1182.5571 1186.5849 1192.6518 1206.0253 1238.1005 1261.5828 1293.7551 1306.1621 1311.7126 1313.6330 1316.9845 1325.7046 1353.3523 1359.8845 1363.9720 1368.9925 1378.2921 1381.6517 1384.3230 1386.1025 1394.6336 1416.3318 1437.4799 1440.4401 1445.3625 1454.3310 1462.3209 1463.8292 1466.8187 1468.1817 1475.8797 1483.4959 1485.6342 1486.5937 1499.2166 1500.9595 1541.8636 1576.7802 1618.1094 2969.7340 2979.5820 2979.7626 2983.9637 2986.1508 2988.9805 3013.7881 3049.4796 3054.6538 3056.2484 3072.3814 3072.5111 3075.3234 3079.9099 3080.0464 3083.6803 3086.1937 3090.6926 3112.8605 3119.5829 3127.4910 3143.8612 3145.2254 3155.4299 3166.5643 3171.0064
redmass: 5.7062 5.8154 6.1062 7.9431 6.4928 5.4636 3.7511 3.7431 2.6255 3.4110 3.0934 4.5444 1.6673 4.3128 1.3891 4.3716 2.5210 1.3942 2.9298 1.1939 1.3144 2.1613 5.1507 2.8867 3.0179 3.0541 2.8110 2.9012 3.4531 3.0870 2.9232 3.1094 2.8459 3.5069 4.1580 2.3934 3.3555 2.8964 4.7185 4.2625 5.2952 5.1381 2.4460 4.0118 3.1505 1.6688 2.6624 2.2975 1.8348 1.5287 1.7355 2.2374 1.2846 1.8948 1.2054 2.3445 1.3243 1.4514 2.2811 1.3163 5.2650 1.8529 2.0000 2.9691 1.7206 1.8608 1.7719 2.4062 2.4250 2.0995 1.8917 1.1898 1.6605 2.0305 1.8875 1.0968 2.5035 1.4100 1.4921 1.3322 1.2202 1.6235 1.6633 1.3393 1.3254 1.4173 1.4645 1.2486 1.2103 1.2249 1.9634 2.1039 1.5549 1.2340 1.7633 1.3715 1.1291 1.8097 1.0457 1.0490 1.1565 1.0682 1.0756 1.0493 1.0708 1.2016 1.4364 1.3011 1.2035 5.3690 5.8642 6.1543 1.0690 1.0679 1.0363 1.0360 1.0365 1.0382 1.0820 1.0868 1.0583 1.0581 1.0997 1.0927 1.0993 1.0983 1.0931 1.1002 1.0972 1.0990 1.0994 1.0988 1.0864 1.1098 1.1101 1.0916 1.0932 1.0926
irintensity: 0.5365 0.7690 0.4765 0.5264 1.0385 6.6417 1.5755 1.8753 1.2792 2.5648 3.1608 2.8052 0.4778 0.2629 0.0917 0.1764 0.8939 0.5727 4.2454 0.3230 0.3398 1.2707 0.6564 3.1401 2.4091 2.2025 1.8811 5.3197 3.0087 3.9439 14.5296 5.1334 1.2417 5.4704 8.1423 2.4921 14.5623 11.3077 14.9333 26.9820 3.8040 0.3951 7.2488 16.1512 47.9907 36.0663 20.8640 1.5442 0.6508 9.8943 17.4338 14.2356 2.8219 56.4645 6.0547 0.5697 0.3428 0.0747 17.2730 1.3167 10.8995 3.8175 43.1791 13.0530 1.8746 3.6314 14.4019 1.4432 18.7638 23.0337 33.0088 14.1726 18.5176 58.3187 13.1196 0.6434 33.3009 33.3575 13.3788 22.5907 52.6475 125.7956 154.4437 12.8948 8.7203 75.6460 105.7055 7.0151 26.0592 33.9806 2.6948 31.7750 29.3741 4.6330 62.2523 61.5884 7.6201 53.6264 0.5011 2.1913 20.5936 21.2056 32.9886 8.6337 8.9403 15.1823 6.7622 56.1205 30.9612 220.5702 21.2528 193.2416 32.8243 14.8337 21.2426 22.2698 37.9314 37.5478 32.8626 3.4560 24.5999 11.6585 4.8038 2.1657 11.3943 79.7770 7.5477 26.3980 51.7592 49.0221 4.7934 17.8153 9.4179 20.9109 20.2775 17.4597 18.6709 9.7367
temp: 298.150 k
press: 1.00000 atm
elementType: 17 17 8 7 7 6 6 6 6 6 6 6 6 6 6 6 6 6 6 6 6 6 1 1 1 1 1 1 1 1 1 1 1 1 1 1 1 1 1 1 1 1 1 1 1 1 1 1
symmnumber: 1
zpe: 1054206.5 jmol-1
zpe.correction: 0.401526 hartree
zpe.thermalcorrener: 0.426418 hartree
zpe.thermalcorrenthalpy: 0.427362 hartree
zpe.thermalcorrgfe: 0.344961 hartree
zpe.sumelectzpe: -1766.555972 hartree
zpe.sumelectthermal: -1766.531080 hartree
zpe.sumelectthermalent: -1766.530136 hartree
zpe.sumelectthermalfe: -1766.612538 hartree
dipole: -1.8168 0.0437 -3.8383
dipole: 4.2468
quadrupole: -137.7666 -149.7439 -151.8358
quadrupole: -6.0057 0.8442 13.2466
quadrupole: 8.6821 -3.2951 -5.3870 -6.0057 0.8442 13.2466
hfenergy: -1766.9574982 hartree
pointgroup: C01 [X(C17H26Cl2N2O1)]
dipole: -0.5405458 -0.9081336 1.2941145 debye
polarizability: 289.3525951|1.4409293|174.7653884|-8.2917938|0.6785721|214.9591301 unknown
InChI: InChI=1S/C17H26Cl2N2O/c1-13(2)21(14(3)4)17(22)15-6-5-7-16(12-15)20(10-8-18)11-9-19/h5-7,12-14H,8-11H2,1-4H3
charge 0 multiplicity 1
48 atoms
Cl 3.993862 -3.01213 -1.715154
Cl 5.466189 2.209106 -1.128933
O  -1.810693 1.120028 -1.53651
N  -2.957403 -0.208152 0.006791
N  3.117686 -0.064188 -0.438065
C  -2.935929 -1.257836 1.076019
C  -4.256907 0.001749 -0.721503
C  -1.8155 0.445544 -0.449851
C  -3.839108 -0.88322 2.275046
C  -3.292742 -2.656057 0.51176
C  -4.230809 -0.548473 -2.168891
C  -4.698874 1.482738 -0.669913
C  -0.537293 0.380982 0.365444
C  1.933674 0.172292 0.287309
C  0.657223 0.155623 -0.3524
C  3.080322 -0.336123 -1.881978
C  4.428153 -0.050463 0.22458
C  -0.490634 0.663882 1.754337
C  1.958301 0.448702 1.692225
C  0.76485 0.697978 2.397437
C  2.667378 -1.767626 -2.254491
C  4.999911 1.350134 0.494312
H  -1.895513 -1.307978 1.436288
H  -5.001019 -0.586514 -0.152245
H  -4.907313 -0.852333 1.992117
H  -3.566092 0.105024 2.685173
H  -3.7289 -1.634596 3.078017
H  -2.613063 -2.933365 -0.313121
H  -4.331342 -2.699709 0.136743
H  -3.194062 -3.413251 1.310976
H  -5.238958 -0.462109 -2.615911
H  -3.51802 0.025225 -2.780764
H  -3.937123 -1.613036 -2.185555
H  -4.753597 1.840683 0.374128
H  -5.700791 1.588427 -1.125381
H  -3.990608 2.116826 -1.226058
H  0.561587 0.00413 -1.430565
H  4.073758 -0.117698 -2.30688
H  2.377304 0.359508 -2.384183
H  5.140032 -0.625055 -0.39094
H  4.369638 -0.585373 1.195209
H  -1.40538 0.890879 2.310441
H  2.902899 0.485391 2.241947
H  0.820507 0.931677 3.466826
H  1.748693 -2.094275 -1.747622
H  2.581685 -1.892966 -3.345166
H  4.275595 2.02344 0.974032
H  5.936126 1.300356 1.07252
