program: Gaussian 09
title: 000212747
version: EM64L-G09RevD.01
frameworkgroup: C1[X(C22H15BrN2O3)]
method: RPBEPBE
basis: SDD
operation: Freq
keyword: #p
keyword: freq=noraman
keyword: PBEPBE/SDD
title: #p freq=noraman PBEPBE/SDD
converged: YES YES NO NO
title: Mulliken charges:
elementType: Br O O O N N C C C C C C C C C C C C C C C C C C C C C C H H H H H H H H H H H H H H H
charge: 0.029162 -0.206556 -0.164035 -0.199209 -0.322994 -0.331316 0.236484 0.294522 -0.667175 0.130375 0.166370 0.417265 -0.242752 -0.276002 0.108983 -0.240973 -0.220046 0.340017 -0.362107 -0.335733 -0.214160 -0.221169 -0.320803 -0.348688 -0.241319 -0.237207 -0.225256 -0.223463 0.294540 0.282612 0.291543 0.295048 0.258808 0.257775 0.270101 0.233822 0.233088 0.253004 0.263592 0.234286 0.239957 0.234454 0.235159
chargesum: 0.00000
title: Mulliken charges with hydrogens summed into heavy atoms:
elementType: Br O O O N N C C C C C C C C C C C C C C C C C C C C C C
charge: 0.029162 -0.206556 -0.164035 -0.199209 -0.322994 -0.331316 0.236484 0.294522 -0.090024 0.130375 0.166370 0.417265 0.048790 0.019046 0.108983 -0.240973 0.038761 0.340017 -0.104332 -0.065633 0.019662 0.011919 -0.067800 -0.085096 -0.007033 0.002750 0.009198 0.011696
polarizability: 3.44990394e+02 2.37802846e+00 2.97873794e+02 6.91668897e+00 1.07463093e+01 1.98044425e+02
1716.lowfreq: -7.2716 -5.3543 -0.2504 -0.0006 -0.0005 0.0005 14.5023 21.9743 40.6627
frequency: 14.4258 21.9298 40.6576 41.5529 45.4113 57.7665 60.0244 92.0928 104.6141 123.6940 138.1118 150.9281 177.9310 191.6501 205.0990 233.8001 258.7887 268.1671 293.9395 318.2625 352.1857 369.9895 390.6961 403.9002 404.6967 414.6670 445.4936 460.5938 469.4465 482.2761 506.2656 512.1397 548.5063 571.8106 595.9762 612.9086 614.3438 625.9540 636.8657 664.1610 668.5985 690.2724 694.5914 703.0857 724.4090 733.8716 744.2802 765.5660 792.9389 814.3976 840.9969 849.8737 855.5761 879.8602 903.2404 915.1641 940.8591 948.8482 952.7748 971.4732 972.6108 974.2931 986.7151 989.5293 989.8365 995.5670 1005.3836 1016.0290 1026.9306 1040.9953 1079.2745 1084.8896 1089.8569 1099.4077 1133.1955 1174.6570 1175.8943 1182.6134 1184.5419 1193.3375 1197.6984 1228.5564 1244.0235 1261.6102 1276.0163 1289.5971 1291.6693 1317.5910 1321.9021 1367.1382 1384.2252 1387.9898 1389.0468 1436.6875 1437.8129 1442.4276 1471.3353 1477.1941 1481.1428 1568.4373 1577.6270 1582.8268 1595.1321 1602.3918 1603.9832 1610.0847 1616.0629 1639.0466 3022.4837 3133.0018 3133.1949 3138.3638 3141.3226 3141.9120 3151.4991 3153.4595 3162.7711 3168.2011 3172.5883 3172.9965 3173.5752 3185.8595 3202.8044
redmass: 7.1108 6.3789 4.4268 5.6285 6.7014 7.7068 6.2584 5.6962 6.9857 8.7594 7.6342 6.6058 7.1046 6.0174 5.4958 7.4680 7.3901 5.1538 7.9900 7.2730 9.0180 6.7132 4.2350 2.8183 2.8454 4.7341 3.8578 6.0916 4.9071 3.3033 3.7803 5.0065 5.4595 5.7194 5.4409 6.4396 6.3112 6.1156 6.0911 6.0506 6.8026 3.6449 1.9937 1.9218 4.2080 6.2615 4.5225 1.7754 2.3524 1.4835 1.2532 5.7825 1.2549 1.4765 4.3183 1.4504 1.5951 1.3755 2.7023 5.4437 1.5824 3.6201 1.4021 5.7320 6.1567 1.3405 1.3474 3.4478 2.1378 2.5536 2.0440 1.6394 1.5889 1.8138 1.8456 1.0508 1.0578 1.4874 1.3548 1.4954 1.7968 4.0317 4.0130 1.5984 1.7712 2.1341 4.9664 1.3243 1.3979 9.3789 8.5085 6.7825 5.1013 2.0900 1.1419 2.2637 2.6753 2.2582 2.3005 8.5965 7.1800 6.9682 6.6209 7.8164 7.2780 6.6878 7.8524 11.6686 1.0653 1.0854 1.0854 1.0979 1.0890 1.0884 1.0926 1.0944 1.0966 1.0992 1.0918 1.1014 1.0921 1.0970 1.0954
irintensity: 1.5095 0.0165 0.2274 0.2224 2.1828 1.2195 3.7984 0.1420 0.3250 5.0934 0.8573 2.1154 1.0540 1.5634 0.6423 6.8741 3.4283 4.0499 3.8467 1.7787 0.0444 0.1658 2.4495 0.5640 0.5392 9.6108 3.6659 11.7564 4.5244 7.9725 23.3724 7.5394 6.7897 6.2851 19.0817 0.6244 2.0794 6.1737 7.8368 3.1432 12.6922 5.7593 31.6826 51.2185 20.2061 62.6893 10.2850 34.8315 33.6750 30.2512 0.2475 45.7072 2.1197 7.9056 27.9292 2.7219 1.3762 1.7764 10.1824 11.7082 6.3077 21.6230 2.0802 1.2798 2.9719 0.6920 0.5388 46.9496 8.8778 52.4574 19.8301 26.6733 6.3378 30.0539 20.6609 0.0193 1.2990 33.6182 122.9345 18.3918 118.9823 41.0243 264.0988 23.1225 57.6164 108.1574 295.9392 2.0439 8.9366 5.2730 0.0198 3.8334 25.0459 25.4166 27.4502 3.4374 199.7756 11.0250 64.6458 12.1855 176.3373 14.1748 1.9353 13.5905 92.9577 9.9656 137.6775 427.4316 0.9080 1.3667 0.8580 0.2520 4.2258 2.7278 19.7400 24.4458 15.5009 20.8611 0.8834 19.2082 0.4100 1.8463 1.2555
temp: 298.150 k
press: 1.00000 atm
elementType: 35 8 8 8 7 7 6 6 6 6 6 6 6 6 6 6 6 6 6 6 6 6 6 6 6 6 6 6 1 1 1 1 1 1 1 1 1 1 1 1 1 1 1
symmnumber: 1
zpe: 825789.7 jmol-1
zpe.correction: 0.314527 hartree
zpe.thermalcorrener: 0.337776 hartree
zpe.thermalcorrenthalpy: 0.338720 hartree
zpe.thermalcorrgfe: 0.258556 hartree
zpe.sumelectzpe: -1194.076443 hartree
zpe.sumelectthermal: -1194.053193 hartree
zpe.sumelectthermalent: -1194.052249 hartree
zpe.sumelectthermalfe: -1194.132413 hartree
dipole: -1.3054 1.2188 -1.7549
dipole: 2.5038
quadrupole: -165.1362 -162.9433 -171.6491
quadrupole: -2.6371 -14.1887 -8.0688
quadrupole: 1.4400 3.6329 -5.0729 -2.6371 -14.1887 -8.0688
hfenergy: -1194.3909692 hartree
pointgroup: C01 [X(C22H15Br1N2O3)]
dipole: -0.5812073 -0.7926285 -0.0658028 debye
polarizability: 314.6443346|18.5609153|208.1613966|-18.2007695|-34.8819574|318.1028815 unknown
InChI: InChI=1S/C22H15BrN2O3/c23-16-11-12-18-19(13-16)24(17-9-5-2-6-10-17)20(26)14-21(27)25(18)22(28)15-7-3-1-4-8-15/h1-13H,14H2
charge 0 multiplicity 1
43 atoms
Br -2.340614 -1.868493 5.125271
O  -1.77501 2.106933 -1.242012
O  2.123323 2.520572 -0.281886
O  3.157984 -0.953828 1.136962
N  -1.508826 0.383752 0.33377
N  1.367529 0.542103 0.745679
C  -0.901086 -0.078198 1.555097
C  0.503013 0.013661 1.778911
C  -0.177404 2.480607 0.569939
C  -1.231708 1.66864 -0.192981
C  1.209764 1.893881 0.302459
C  -2.483036 -0.484915 -0.31155
C  -1.736935 -0.633461 2.558559
C  1.042555 -0.431743 3.011586
C  2.531802 -0.235575 0.316187
C  -1.170123 -1.096162 3.756044
C  0.216417 -1.000336 4.00134
C  2.858978 -0.201697 -1.137399
C  -2.15266 -1.847826 -0.510174
C  -3.740911 0.012063 -0.727154
C  -3.085958 -2.714938 -1.116686
C  -4.664268 -0.861579 -1.341789
C  1.868262 0.009273 -2.132823
C  4.194542 -0.490337 -1.522595
C  -4.344713 -2.225192 -1.536032
C  2.216979 -0.053787 -3.49676
C  4.541725 -0.539141 -2.886566
C  3.553832 -0.319361 -3.876693
H  -0.189743 3.506195 0.17688
H  -0.391346 2.494412 1.654279
H  -2.813479 -0.697474 2.381611
H  2.118675 -0.357278 3.174574
H  0.645466 -1.355189 4.941821
H  -1.174158 -2.223379 -0.192154
H  -3.98626 1.067411 -0.588473
H  -2.826064 -3.768195 -1.266902
H  -5.635991 -0.474394 -1.666448
H  0.827852 0.19994 -1.848977
H  4.941375 -0.669269 -0.742447
H  -5.066832 -2.89806 -2.010672
H  1.44877 0.105041 -4.260552
H  5.576024 -0.747205 -3.180167
H  3.823357 -0.358369 -4.937978
