program: Gaussian 09
title: 000212729
version: EM64L-G09RevD.01
frameworkgroup: C1[X(C13H18N5O)]
method: RPBEPBE
basis: SDD
operation: Freq
keyword: #p
keyword: freq=noraman
keyword: PBEPBE/SDD
title: #p freq=noraman PBEPBE/SDD
converged: YES YES NO NO
title: Mulliken charges:
elementType: O N N N N N C C C C C C C C C C C C C H H H H H H H H H H H H H H H H H H
charge: -0.093292 -0.093534 -0.072443 -0.156629 0.130953 -0.601563 -0.367314 -0.343369 -0.401575 -0.418343 -0.500232 0.440259 0.430247 -0.370911 -0.441451 -0.170509 -0.223056 -0.214759 -0.233781 0.271893 0.214533 0.192399 0.246651 0.257887 0.268781 0.274450 0.248547 0.234565 0.212942 0.248250 0.237722 0.323766 0.236943 0.239884 0.373065 0.375835 0.243191
chargesum: 1.00000
title: Mulliken charges with hydrogens summed into heavy atoms:
elementType: O N N N N N C C C C C C C C C C C C C
charge: -0.093292 -0.093534 -0.072443 -0.156629 0.130953 0.147336 0.119112 0.095681 0.125093 0.104654 -0.052725 0.440259 0.430247 -0.122661 -0.203729 0.153256 0.013887 0.025125 0.009410
polarizability: 3.56277799e+02 1.64365957e+01 1.74433492e+02 -9.65884265e+00 -1.17768632e+01 1.20069566e+02
1716.lowfreq: -5.0355 -0.9161 0.0004 0.0007 0.0007 20.3015 26.9886 33.6850 38.2264
frequency: 26.1082 33.5828 37.9359 67.3896 76.9583 100.6854 157.7255 189.3510 220.0239 245.3236 263.2277 264.5681 301.8096 322.7553 355.4774 375.2719 391.9398 404.5023 415.0112 455.9066 472.3061 496.7349 548.1025 551.0956 560.2058 602.3103 617.6998 646.4772 658.0724 704.5438 707.7887 720.5801 740.1720 777.4976 812.4638 832.8138 836.6135 859.6174 883.9783 919.4528 924.0250 934.1551 982.2507 983.9477 988.8163 991.9190 1005.4737 1008.8342 1027.3348 1038.8120 1045.4537 1056.9045 1074.4288 1082.9089 1088.5309 1124.9900 1135.7538 1166.1472 1176.6369 1185.2927 1195.5094 1204.4912 1217.0932 1237.5407 1262.0380 1273.4024 1287.3142 1300.2600 1319.9576 1335.6293 1342.0004 1343.1690 1361.8035 1380.2740 1390.5605 1395.6701 1443.0952 1450.2613 1452.4874 1458.0224 1466.5451 1475.2012 1485.8816 1595.9182 1605.6768 1614.2092 1679.7512 2849.6532 2875.7800 2892.0494 2982.9561 2996.9255 3003.8782 3051.2903 3062.7002 3074.6948 3087.4074 3118.5292 3127.7626 3142.1628 3153.1511 3170.3852 3272.7209 3518.9664 3665.3649
redmass: 4.1205 5.1804 5.0942 4.1192 3.5642 4.9395 3.7802 4.7112 3.9357 2.8791 3.2673 2.8071 3.5019 2.3225 3.0491 1.3333 2.0953 2.8164 3.4062 3.1030 3.1020 3.7619 2.5672 3.2394 1.5729 4.4439 6.3915 2.9954 3.4743 2.1820 5.3384 1.6899 1.7744 2.5775 3.7718 2.7164 2.3106 1.2466 4.2177 1.4673 7.0413 1.9802 2.5881 1.3970 3.5778 2.8255 1.4772 2.1242 2.1402 1.9805 1.9265 1.9494 2.2986 4.1183 1.8956 2.9876 3.5436 2.0518 1.0602 1.1093 1.1501 1.9581 2.4956 1.4924 1.6608 1.4940 1.6789 1.3973 1.3611 1.2714 1.4183 1.5138 1.4687 2.5870 2.9972 2.2212 2.0530 1.0783 1.0797 1.1054 1.1021 1.1730 2.0528 6.0951 1.1597 6.1390 6.7292 1.0710 1.0707 1.0695 1.0620 1.0615 1.0898 1.0884 1.0891 1.1021 1.1031 1.0892 1.0867 1.0906 1.0958 1.1014 1.1029 1.0478 1.1031
irintensity: 0.1824 1.3093 2.7415 0.1336 0.7171 2.5973 9.9915 1.1873 2.2007 11.7016 2.1301 1.7102 9.7075 26.5048 3.2827 7.2128 0.6758 1.0214 4.0253 12.0315 11.2549 1.4636 118.4263 10.4978 146.3936 4.9239 0.0100 9.2419 19.8224 38.3827 43.1254 61.2291 42.6036 36.9434 9.5243 8.8869 9.9572 0.1168 38.2581 13.9005 70.5756 1.6981 2.9853 1.0232 0.2223 7.0481 3.2052 8.0251 11.7005 7.0600 20.7385 23.9133 8.5554 61.1821 18.4768 69.1822 12.1616 4.1513 0.6512 4.5531 3.6371 1.2550 2.1852 22.9316 23.1632 33.4060 71.6019 6.4096 25.8003 13.3595 13.2633 35.6154 17.4553 31.1786 59.1878 11.8687 20.0008 10.4647 2.2091 9.2517 15.8277 31.7561 3.4701 1.9719 51.1864 2.0969 379.3299 70.3015 49.3188 121.4733 30.4707 10.2700 15.8442 14.7870 3.5716 10.1285 7.9925 8.9441 6.2284 5.3876 28.1910 19.2302 59.7461 105.7718 125.1517
temp: 298.150 k
press: 1.00000 atm
elementType: 8 7 7 7 7 7 6 6 6 6 6 6 6 6 6 6 6 6 6 1 1 1 1 1 1 1 1 1 1 1 1 1 1 1 1 1 1
symmnumber: 1
zpe: 797292.1 jmol-1
zpe.correction: 0.303673 hartree
zpe.thermalcorrener: 0.320640 hartree
zpe.thermalcorrenthalpy: 0.321584 hartree
zpe.thermalcorrgfe: 0.257580 hartree
zpe.sumelectzpe: -853.380460 hartree
zpe.sumelectthermal: -853.363492 hartree
zpe.sumelectthermalent: -853.362548 hartree
zpe.sumelectthermalfe: -853.426552 hartree
dipole: -12.7806 3.7249 -1.2826
dipole: 13.3740
quadrupole: -21.1477 -97.0862 -105.5363
quadrupole: -14.3322 1.3368 -1.8381
quadrupole: 53.4424 -22.4962 -30.9462 -14.3322 1.3368 -1.8381
hfenergy: -853.6841321 hartree
pointgroup: C01 [X(C13H18N5O1)]
dipole: 5.062073 -1.0083472 -1.0220404 debye
polarizability: 355.0968613|8.896936|150.6852607|22.7101236|29.7291158|144.9987346 unknown
InChI: InChI=1S/C13H18N5O/c14-13-11-19-15-18(13)17-8-6-16(7-9-17)10-12-4-2-1-3-5-12/h1-5,11H,6-10,14H2
charge 1 multiplicity 1
37 atoms
O  4.65641 1.669211 1.153089
N  -0.833416 -0.911229 -0.167256
N  1.89063 -0.07808 -0.198804
N  3.131308 0.404651 0.23176
N  3.254788 1.482911 1.09019
N  4.426752 -1.119811 -1.129561
C  -0.435775 0.331156 -0.860912
C  0.242738 -1.915374 -0.22461
C  0.788288 0.94921 -0.169935
C  1.499421 -1.377699 0.479269
C  -2.164986 -1.439552 -0.582579
C  -3.30279 -0.479165 -0.260694
C  4.365158 -0.092223 -0.242576
C  -3.421308 0.088488 1.034339
C  -4.282633 -0.177154 -1.237447
C  5.319749 0.719783 0.373513
C  -4.501589 0.942783 1.344628
C  -5.369129 0.673533 -0.926756
C  -5.480323 1.236143 0.364786
H  -1.266695 1.055006 -0.802148
H  -0.209403 0.156777 -1.94236
H  0.506754 -2.203534 -1.275083
H  -0.081128 -2.830188 0.303261
H  1.137834 1.847137 -0.707153
H  0.534818 1.216982 0.874177
H  1.282332 -1.175408 1.54747
H  2.333837 -2.096291 0.40133
H  -2.310634 -2.390977 -0.033777
H  -2.184121 -1.687361 -1.671417
H  -2.663638 -0.144769 1.791577
H  -4.203282 -0.612452 -2.24159
H  6.402504 0.790063 0.330451
H  -4.588186 1.372337 2.348751
H  -6.124009 0.895483 -1.688619
H  5.323799 -1.489025 -1.438406
H  3.581047 -1.402128 -1.628188
H  -6.321917 1.893663 0.607481
