program: Gaussian 09
title: 000212670
version: EM64L-G09RevD.01
frameworkgroup: C1[X(C22H29NO2)]
method: RPBEPBE
basis: SDD
operation: Freq
keyword: #p
keyword: freq=noraman
keyword: PBEPBE/SDD
title: #p freq=noraman PBEPBE/SDD
converged: YES YES NO NO
title: Mulliken charges:
elementType: O O N C C C C C C C C C C C C C C C C C C C C C C H H H H H H H H H H H H H H H H H H H H H H H H H H H H H
charge: -0.269784 -0.241200 -0.064804 0.134818 -0.454855 -0.476287 -0.424244 -0.428134 -0.388620 0.421241 0.183036 -0.367471 -0.410097 -0.471446 -0.435422 -0.431109 -0.434390 -0.410299 -0.079508 -0.270134 -0.254368 -0.234588 -0.701450 -0.020214 0.026121 0.210910 0.228596 0.232134 0.190720 0.195635 0.229073 0.211174 0.195857 0.201607 0.187918 0.255771 0.250513 0.227276 0.219898 0.215745 0.237401 0.220448 0.225556 0.251364 0.225170 0.223411 0.240123 0.261219 0.225055 0.224129 0.225459 0.224084 0.227370 0.239597
chargesum: 0.00000
title: Mulliken charges with hydrogens summed into heavy atoms:
elementType: O O N C C C C C C C C C C C C C C C C C C C C C C
charge: -0.269784 -0.241200 -0.064804 0.134818 -0.015349 -0.053433 0.000465 -0.021104 0.000905 0.421241 0.183036 -0.111700 -0.159584 -0.024272 0.017723 0.014895 0.042143 0.053235 0.181711 -0.045080 -0.030239 -0.009129 -0.010398 -0.020214 0.026121
polarizability: 2.89570934e+02 -3.21829952e+01 2.23185548e+02 -7.90993841e+00 -4.80672749e+00 2.03521902e+02
1716.lowfreq: -21.9824 -17.8955 -3.9229 -0.0007 -0.0005 0.0003 3.2373 13.6824 27.0410
frequency: -19.1726 11.7946 26.1654 29.9203 39.0938 47.7350 54.4002 67.6162 81.5669 101.5580 113.8703 123.0836 135.1748 164.8697 183.4517 193.3398 215.8208 242.2256 254.5523 280.2543 290.6415 299.7867 318.2888 340.0111 348.1298 366.2682 379.2368 401.5504 407.3019 432.1632 468.4417 488.1610 517.0553 525.5514 547.6802 573.7358 616.5190 619.7073 626.1785 644.2724 697.9195 705.1033 738.3806 755.1765 761.1749 773.1345 786.4264 788.9303 823.9190 828.2404 837.0143 841.0377 853.0181 875.1411 895.4825 903.9653 905.3207 921.2554 930.3314 930.9359 939.6333 964.7807 977.6306 980.7106 990.4707 994.0238 1006.4663 1009.5345 1032.4884 1037.3017 1051.8685 1057.0804 1067.4916 1071.2975 1087.1286 1092.7039 1102.2008 1104.8572 1113.3118 1142.6507 1168.9752 1170.4559 1172.9431 1180.9243 1185.4341 1188.1514 1200.3456 1211.7764 1218.4577 1233.0223 1246.0788 1254.4189 1274.2207 1276.9721 1283.0795 1289.4681 1297.9427 1306.4837 1316.5147 1317.2737 1323.3284 1327.7175 1335.9954 1341.2233 1342.9888 1345.5193 1356.8333 1378.4118 1390.0807 1433.3375 1451.5487 1452.0006 1460.4926 1461.2395 1462.6559 1468.3731 1470.2204 1471.7893 1472.4555 1474.8842 1481.3120 1483.2966 1489.2322 1588.3980 1606.4292 1615.5561 2282.2386 2850.6882 2965.2581 2973.9699 2980.0447 2985.4031 2988.8486 2991.8994 2999.8878 3001.1749 3001.3634 3007.9979 3013.5375 3018.2426 3028.4541 3034.0661 3046.2616 3054.7935 3062.1100 3067.7909 3069.5258 3078.0461 3091.5192 3102.9094 3113.0242 3118.3529 3127.8033 3140.7182 3154.1906 3168.2643
redmass: 3.5544 3.5811 4.8373 3.8668 3.6617 3.6334 4.0269 2.1625 3.9661 4.7670 3.1366 3.7309 3.4338 3.3086 3.0206 2.1894 1.6642 2.5065 3.1144 4.9941 2.4791 2.9325 3.4822 3.7745 3.9790 2.7545 2.0604 2.7933 2.6804 3.3979 3.9538 2.3791 3.8253 3.8139 2.7242 4.1507 6.0775 3.3826 2.9661 3.1198 6.1347 1.7233 3.1935 2.0095 2.6840 2.5471 2.2032 1.9760 2.0052 2.3636 2.4077 2.0382 1.2685 3.5275 2.4533 2.1824 2.1582 1.9453 1.6554 1.5424 2.0513 1.8332 1.4005 2.0972 5.1326 1.3635 2.9688 2.6565 2.1490 2.0255 1.9038 1.8403 2.3433 1.7898 2.1454 1.4256 1.8825 2.3589 2.5452 1.7369 1.5733 1.8286 1.0724 2.8999 1.3135 1.9037 1.1490 2.0003 1.1838 1.2217 1.3515 1.3265 1.2972 1.2135 1.3474 1.5897 1.2349 1.3907 1.2942 1.3253 1.4994 1.3788 1.3812 1.4531 1.4716 1.4407 1.4243 6.0376 1.2147 2.2257 1.1017 1.0794 1.0802 1.0589 1.0841 1.0812 1.0839 1.0649 1.0751 1.0830 1.0955 2.0330 1.0915 5.9431 6.8384 8.9352 11.8350 1.0700 1.0628 1.0633 1.0634 1.0611 1.0658 1.0633 1.0614 1.0628 1.0368 1.0848 1.0839 1.0645 1.0956 1.1007 1.1009 1.1003 1.0982 1.0988 1.1017 1.1029 1.1049 1.1002 1.1011 1.0845 1.0881 1.0936 1.0971 1.0968
irintensity: 0.4572 0.2082 0.6510 0.6626 0.1173 0.0897 0.2255 0.8007 0.5649 0.4787 0.9348 1.5893 1.1384 2.0179 0.5230 0.4814 0.6106 2.4245 3.8929 0.2938 1.7680 0.8917 4.7204 8.7143 0.8889 1.7949 7.1910 0.6026 1.1827 1.0296 0.5257 7.5081 19.9999 0.4331 6.4016 4.4844 0.1777 2.3931 9.2815 5.5283 2.3166 63.9885 1.3703 24.7143 3.1108 13.1978 39.4468 18.6813 7.2907 9.3457 4.4085 3.8063 0.3460 13.1346 28.6986 6.6392 14.5497 2.8887 13.6867 11.1322 16.4274 5.4749 1.5633 49.5840 0.3335 0.0889 28.8703 33.8900 26.2470 34.6710 96.7877 2.5445 25.9030 12.8866 142.9779 5.1701 11.7517 3.4960 15.8219 10.2354 29.8288 20.6201 0.0330 5.2723 9.2821 13.4874 1.0888 4.3597 2.9350 15.6698 4.5525 3.5608 2.1272 4.9508 7.0518 7.8304 0.9685 3.5941 20.1752 0.6228 44.3490 1.9107 0.2732 2.6442 1.8328 24.0581 0.8593 0.0382 17.6917 10.9766 5.0878 8.9756 14.7503 3.7736 4.4274 9.4821 9.1246 22.4252 5.6914 5.8054 6.9667 22.9307 6.9875 3.3885 63.0988 79.4747 11.2848 53.2168 41.5913 27.2497 17.1056 37.5936 28.9300 49.8004 22.5435 46.2302 29.4922 13.5973 8.0795 35.9520 78.5858 47.7679 65.2572 17.7997 21.2686 30.0960 10.6140 25.7221 80.5768 25.7311 19.6627 0.8891 6.5559 20.1285 32.5906 11.7336
temp: 298.150 k
press: 1.00000 atm
elementType: 8 8 7 6 6 6 6 6 6 6 6 6 6 6 6 6 6 6 6 6 6 6 6 6 6 1 1 1 1 1 1 1 1 1 1 1 1 1 1 1 1 1 1 1 1 1 1 1 1 1 1 1 1 1
symmnumber: 1
zpe: 1206729.1 jmol-1
zpe.correction: 0.459619 hartree
zpe.thermalcorrener: 0.483730 hartree
zpe.thermalcorrenthalpy: 0.484674 hartree
zpe.thermalcorrgfe: 0.403308 hartree
zpe.sumelectzpe: -1058.983373 hartree
zpe.sumelectthermal: -1058.959262 hartree
zpe.sumelectthermalent: -1058.958318 hartree
zpe.sumelectthermalfe: -1059.039684 hartree
dipole: 0.7773 -0.9496 0.9071
dipole: 1.5261
quadrupole: -136.5189 -145.5278 -149.6782
quadrupole: -6.3745 -8.6232 -1.1894
quadrupole: 7.3894 -1.6195 -5.7699 -6.3745 -8.6232 -1.1894
hfenergy: -1059.442992 hartree
pointgroup: C01 [X(C22H29N1O2)]
dipole: -0.2312171 -0.5002606 -0.2382415 debye
polarizability: 283.0593557|35.709171|232.310229|-12.5189589|-2.0478907|200.9087997 unknown
InChI: InChI=1S/C22H29NO2/c1-19(11-10-18-23-16-8-9-17-23)25-21(24)22(14-6-3-7-15-22)20-12-4-2-5-13-20/h2,4-5,12-13,19H,3,6-9,14-18H2,1H3
charge 0 multiplicity 1
54 atoms
O  1.055812 1.54444 -0.75971
O  1.380598 1.909691 1.516382
N  -4.359471 0.451417 -0.795186
C  2.414868 -0.086936 0.433903
C  3.384588 -0.140016 1.65915
C  3.246616 -0.171995 -0.878598
C  4.507739 0.920694 1.590655
C  4.344799 0.914833 -0.949695
C  5.298098 0.835087 0.264726
C  1.363642 -1.223529 0.563516
C  1.597219 1.226416 0.488373
C  0.502863 -1.242815 1.694932
C  1.235993 -2.26093 -0.393446
C  -5.57729 -1.228743 0.511348
C  -4.231733 -1.869211 0.034343
C  -5.739265 0.028982 -0.407878
C  -3.654852 -0.849455 -1.016073
C  -3.717806 1.290392 0.265394
C  0.066584 2.697346 -0.793912
C  -0.444568 -2.272653 1.870629
C  0.288157 -3.295997 -0.217765
C  -0.554611 -3.310042 0.915241
C  0.141464 3.253722 -2.222137
C  -2.391925 1.794638 -0.129111
C  -1.266287 2.207498 -0.418344
H  3.827581 -1.155888 1.680338
H  2.810053 -0.012912 2.593098
H  2.579751 -0.097626 -1.755282
H  3.735711 -1.166881 -0.908132
H  5.189406 0.783469 2.452283
H  4.062201 1.928925 1.69629
H  3.872564 1.917627 -0.988258
H  4.91278 0.79805 -1.89285
H  6.05155 1.644811 0.215149
H  5.854071 -0.125023 0.22799
H  0.563995 -0.437621 2.436515
H  1.868246 -2.2707 -1.285823
H  -5.515228 -0.928377 1.573298
H  -6.432742 -1.919788 0.413411
H  -4.392503 -2.858675 -0.429123
H  -3.531319 -2.011167 0.875611
H  -6.279879 -0.251517 -1.331908
H  -6.288967 0.860392 0.066408
H  -2.563407 -0.715425 -0.938806
H  -3.883304 -1.192695 -2.042155
H  -3.606633 0.754722 1.242125
H  -4.385834 2.153465 0.452274
H  0.415286 3.4370 -0.047857
H  -1.09449 -2.266742 2.753424
H  0.209436 -4.090214 -0.969156
H  -1.287058 -4.114081 1.050567
H  -0.543065 4.113586 -2.323186
H  1.169698 3.585632 -2.445721
H  -0.154636 2.483416 -2.952864
