program: Gaussian 09
title: 000212657
version: EM64L-G09RevD.01
frameworkgroup: C1[X(C13H16N2O3)]
method: RPBEPBE
basis: SDD
operation: Freq
keyword: #p
keyword: freq=noraman
keyword: PBEPBE/SDD
title: #p freq=noraman PBEPBE/SDD
converged: YES YES NO NO
title: Mulliken charges:
elementType: O O O N N C C C C C C C C C C C C C H H H H H H H H H H H H H H H H
charge: -0.195160 -0.232539 -0.425915 -0.410531 -0.345861 -0.163383 -0.406077 -0.033763 0.150441 0.190616 -0.708012 -0.720274 0.385577 0.183688 -0.311704 -0.366696 -0.244168 -0.204870 0.257855 0.223843 0.239514 0.210132 0.339956 0.205213 0.226752 0.217018 0.199708 0.223499 0.221010 0.251494 0.220091 0.231489 0.229043 0.362017
chargesum: 0.00000
title: Mulliken charges with hydrogens summed into heavy atoms:
elementType: O O O N N C C C C C C C C C C C C C
charge: -0.195160 -0.232539 -0.063898 -0.070575 -0.345861 0.094472 0.057279 0.176369 0.150441 0.190616 -0.059029 -0.076057 0.385577 0.183688 -0.060210 -0.146606 -0.012678 0.024173
polarizability: 2.19594021e+02 4.92504025e+00 1.49182901e+02 2.47605756e+00 9.58493407e+00 1.14689684e+02
1716.lowfreq: -0.0005 0.0007 0.0008 1.7245 5.1650 8.9753 29.4737 35.2604 41.9054
frequency: 29.3868 35.1161 41.8875 67.8803 86.3720 117.5507 140.2014 157.9963 186.2636 191.7253 220.9859 253.8491 281.4843 283.9373 309.3760 321.6687 342.8557 363.6154 403.2529 442.8844 454.0063 475.5978 487.3684 524.0662 538.6349 554.9421 603.5027 617.4237 636.1998 672.5540 713.4693 718.8078 749.6036 762.1372 800.5504 810.9891 839.9105 860.6186 912.6612 928.8985 932.9565 954.4117 964.1942 972.2934 1006.8980 1032.8334 1037.6496 1055.1416 1087.0678 1120.7759 1130.0408 1149.8821 1157.3530 1172.0366 1194.2383 1197.6119 1233.6462 1248.4605 1260.0717 1293.5219 1307.2261 1315.9984 1343.0358 1352.1725 1366.4159 1372.8210 1377.1898 1392.7649 1396.0190 1442.8151 1452.1427 1468.1821 1478.8389 1486.9486 1495.4218 1506.1572 1610.4698 1614.4504 1660.7371 1720.3487 2961.4075 2967.6648 2973.6713 2985.3744 2991.1994 3048.3833 3052.5936 3064.0648 3071.0482 3078.1577 3118.2494 3144.2123 3158.5914 3176.4360 3591.9171 3619.6623
redmass: 4.5202 3.7251 4.6264 4.0283 4.8917 3.7901 7.0202 4.0351 5.1638 4.0569 1.1341 6.2473 1.0579 1.9062 1.9501 3.1159 4.9901 2.1771 2.8234 4.0446 3.3722 3.6725 1.1614 3.1243 4.7777 5.3744 9.6019 3.6371 5.5722 6.5175 7.0448 4.6019 1.4632 3.1714 4.3509 4.3651 1.5055 2.0355 1.3548 1.6997 1.7255 1.9264 1.8669 1.3247 2.8433 3.4411 2.1238 2.0733 2.1220 1.8048 1.9327 1.2675 3.3015 1.0692 1.9484 2.2094 1.2883 2.1330 2.2156 1.4380 1.6895 1.4818 1.4624 1.4561 1.7463 3.3323 1.2614 7.7859 1.2244 2.5596 1.0841 1.0465 1.0544 1.0497 1.0559 3.0768 6.8879 6.8670 11.5249 10.5686 1.0413 1.0733 1.0378 1.0748 1.0716 1.1024 1.0982 1.0981 1.0993 1.0997 1.0886 1.0887 1.0937 1.1002 1.0663 1.0796
irintensity: 1.0861 0.3736 0.9790 3.1916 4.6705 0.9371 0.9721 3.4980 2.1505 3.1187 0.1586 9.2049 0.6226 52.2921 60.1599 4.7572 1.8135 0.6193 2.2657 14.2776 4.1237 4.9291 113.1868 6.8202 3.2605 3.5819 26.8310 7.2715 3.9536 13.1313 8.0843 8.8063 93.4579 15.8607 11.8300 14.6699 3.4471 16.2927 3.6259 3.3992 5.6711 0.8787 0.1297 0.5129 8.8832 5.3937 3.1582 50.8731 129.5936 14.7590 4.4824 30.6685 88.9285 6.0793 6.5895 87.1361 5.9132 10.6074 30.9066 55.1888 27.9295 14.3560 17.2514 68.7309 62.5521 202.2246 21.0461 14.8565 17.2405 23.9067 8.1044 2.0935 4.3588 25.0763 17.6380 98.5798 19.2701 12.1079 537.5867 176.8599 22.6232 16.3471 24.4931 8.3408 25.6997 12.2232 35.8921 78.4744 51.8914 42.6785 10.3102 6.5302 20.5347 11.4668 39.2001 58.6512
temp: 298.150 k
press: 1.00000 atm
elementType: 8 8 8 7 7 6 6 6 6 6 6 6 6 6 6 6 6 6 1 1 1 1 1 1 1 1 1 1 1 1 1 1 1 1
symmnumber: 1
zpe: 713597.0 jmol-1
zpe.correction: 0.271795 hartree
zpe.thermalcorrener: 0.289253 hartree
zpe.thermalcorrenthalpy: 0.290197 hartree
zpe.thermalcorrgfe: 0.225678 hartree
zpe.sumelectzpe: -838.854665 hartree
zpe.sumelectthermal: -838.837207 hartree
zpe.sumelectthermalent: -838.836263 hartree
zpe.sumelectthermalfe: -838.900782 hartree
dipole: -1.6280 -1.5229 -0.8514
dipole: 2.3862
quadrupole: -79.7736 -111.8384 -106.3561
quadrupole: -9.1076 -0.3774 14.3047
quadrupole: 19.5491 -12.5157 -7.0334 -9.1076 -0.3774 14.3047
hfenergy: -839.1264601 hartree
pointgroup: C01 [X(C13H16N2O3)]
dipole: 0.6238695 0.085863 0.6962737 debye
polarizability: 219.0654419|5.5851208|113.7133878|7.1487042|-6.4617266|150.6877759 unknown
InChI: InChI=1S/C13H16N2O3/c1-8(2)7-9-12(17)15(13(18)14-9)10-5-3-4-6-11(10)16/h3-6,8-9,14,16H,7H2,1-2H3
charge 0 multiplicity 1
34 atoms
O  0.34652 -1.780786 1.024895
O  -0.439313 1.676055 -2.104073
O  -1.51487 0.465131 2.005784
N  1.544469 0.724356 -1.205766
N  -0.425969 -0.092266 -0.46922
C  1.927342 -0.316179 -0.237666
C  2.770169 0.1673 0.971854
C  4.301787 0.277352 0.725867
C  0.547418 -0.848706 0.214553
C  0.176305 0.879667 -1.359042
C  4.95668 -1.108633 0.508289
C  4.668794 1.246362 -0.425357
C  -1.839429 -0.213062 -0.278759
C  -2.394757 0.037642 1.004247
C  -2.685644 -0.565949 -1.350331
C  -3.785289 -0.11454 1.212093
C  -4.077112 -0.695772 -1.150912
C  -4.621617 -0.481758 0.13585
H  2.452328 -1.151031 -0.744201
H  2.365099 1.143269 1.302591
H  2.592474 -0.555782 1.791789
H  4.724664 0.700262 1.661391
H  2.200095 1.316443 -1.709533
H  4.60229 -1.586364 -0.425157
H  4.730967 -1.795074 1.344655
H  6.055394 -1.014334 0.42943
H  4.388549 0.82399 -1.411028
H  5.75977 1.421145 -0.455091
H  4.173445 2.228388 -0.306102
H  -2.243297 -0.733447 -2.337001
H  -4.212823 0.068272 2.206363
H  -4.726556 -0.968276 -1.988325
H  -5.69826 -0.592428 0.303659
H  -1.970122 0.508353 2.882256
