program: Gaussian 09
title: 000212650
version: EM64L-G09RevD.01
frameworkgroup: C1[X(C19H29N5O4)]
method: RPBEPBE
basis: SDD
operation: Freq
keyword: #p
keyword: freq=noraman
keyword: PBEPBE/SDD
title: #p freq=noraman PBEPBE/SDD
converged: YES YES NO NO
title: Mulliken charges:
elementType: O O O O N N N N N C C C C C C C C C C C C C C C C C C C H H H H H H H H H H H H H H H H H H H H H H H H H H H H H
charge: -0.244061 -0.219881 -0.269845 -0.255365 -0.443366 -0.457251 -0.165028 -0.192987 -0.041037 0.293184 0.303271 -0.470736 -0.441107 -0.442258 -0.443196 -0.416751 -0.415860 -0.414958 -0.415713 -0.386727 -0.389845 0.139006 0.109471 0.220727 0.210280 -0.417606 -0.348096 -0.623572 0.270767 0.219517 0.227758 0.215466 0.220263 0.232080 0.232218 0.217453 0.192332 0.208005 0.209363 0.197987 0.193406 0.215739 0.216157 0.194156 0.199544 0.204235 0.204309 0.209262 0.316271 0.319656 0.246044 0.254559 0.242131 0.275182 0.216947 0.260847 0.227652
chargesum: 0.00000
title: Mulliken charges with hydrogens summed into heavy atoms:
elementType: O O O O N N N N N C C C C C C C C C C C C C C C C C C C
charge: -0.244061 -0.219881 -0.269845 -0.255365 -0.127095 -0.137596 -0.165028 -0.192987 -0.041037 0.293184 0.303271 0.019548 0.002117 0.010085 0.006475 -0.016415 -0.008510 -0.005813 -0.005399 0.017053 0.023725 0.139006 0.109471 0.220727 0.210280 0.082998 0.169217 0.081874
polarizability: 2.85114673e+02 -1.04677261e+01 2.40233478e+02 2.84176842e+00 2.12812886e+00 2.03855665e+02
1716.lowfreq: -7.1974 -0.0007 -0.0002 -0.0001 4.7628 6.2448 13.6988 27.3634 35.6404
frequency: 13.4311 27.2996 35.6215 42.6954 47.3645 51.8717 70.1613 87.4226 93.5588 99.4389 104.5842 116.2333 134.0260 163.2006 169.1366 175.5472 194.3543 218.8582 224.6236 241.1625 257.6266 258.1917 268.3695 270.8896 307.1763 315.7361 361.8868 365.8525 367.6057 401.7783 403.7840 418.8870 438.1167 448.2098 456.6415 480.8203 484.7296 488.4347 499.0393 513.9972 580.6805 591.3779 605.2687 607.7133 664.8069 681.0448 686.5547 687.6911 706.4212 708.5942 735.0603 743.8134 780.2664 781.0987 809.2645 817.0536 835.8498 846.8994 848.4734 862.9435 864.4192 912.9315 913.6695 927.0882 929.3250 930.9366 936.4167 978.1938 989.3021 994.3030 999.5056 1055.1072 1055.4222 1059.5911 1061.3171 1061.8941 1089.0333 1091.5221 1098.5775 1100.0542 1107.7046 1115.2596 1119.0174 1136.3761 1138.1285 1156.3835 1158.9964 1196.5090 1197.2116 1205.2630 1217.4092 1252.3393 1255.6126 1267.4988 1271.6581 1272.5693 1274.2634 1283.2948 1288.4555 1308.4102 1318.7086 1320.8434 1322.6780 1333.5861 1334.5692 1337.5380 1341.7332 1343.0902 1343.8874 1350.1101 1353.4861 1361.6821 1367.4861 1376.0670 1381.7124 1412.1195 1421.4362 1440.3005 1454.2709 1454.8920 1460.0123 1460.4998 1463.8829 1467.3205 1468.4755 1469.4421 1470.6353 1474.5601 1478.4824 1479.1099 1480.0156 1491.2245 1636.0739 1641.2750 1702.8911 1706.9208 2924.2261 2960.5016 2961.5524 2962.0314 2965.6561 2967.6348 2971.6722 2975.6408 2988.6132 2990.0135 2993.6986 2994.9396 3002.4246 3022.6060 3028.9281 3032.4876 3034.1182 3036.7892 3040.3593 3043.3888 3054.3404 3055.0936 3060.1008 3065.2086 3069.6964 3077.2173 3082.2140 3609.7203 3612.3754
redmass: 5.1486 4.9109 4.8376 5.2555 2.7512 4.9298 2.8827 3.7571 3.3256 2.9538 4.3811 2.4450 2.9838 5.9265 6.4189 5.5731 5.3275 2.2177 2.2357 2.9754 2.8364 3.4675 3.1918 3.7069 4.6835 4.0789 2.9690 1.8372 1.8533 2.9043 2.8427 2.8944 1.7225 1.1695 2.0740 2.4671 3.1435 2.9573 1.8577 2.3858 4.0473 3.9417 9.2225 8.3450 3.8657 3.4710 9.1002 8.8419 4.9923 6.2515 7.3277 7.9990 1.4795 1.4888 3.4533 3.3537 3.8174 1.4994 1.5135 3.2824 3.5388 2.5691 2.6209 1.9324 1.3849 1.5858 2.5430 2.5389 2.1052 2.0263 2.4353 1.9561 1.9791 1.8757 1.5252 1.6411 3.9026 3.4228 1.6028 1.6486 3.9794 1.4862 2.4577 1.6240 1.5988 2.7231 2.6720 1.7355 1.7391 2.6690 2.4166 1.4857 1.3368 1.7688 1.4783 1.3134 1.8451 2.1510 1.8206 2.5053 1.3652 1.4176 2.1570 1.3714 1.3699 1.6016 1.7905 1.5088 1.4912 1.5421 1.5447 1.6861 1.6438 1.6981 1.4907 1.5268 1.3368 1.1358 1.0854 1.0832 1.0872 1.1168 1.0856 1.1305 1.0851 1.0825 1.0849 1.0781 1.0493 1.0906 1.0930 1.0643 11.2694 11.3417 9.7310 9.7318 1.0470 1.0663 1.0655 1.0663 1.0663 1.0652 1.0611 1.0613 1.0606 1.0601 1.0611 1.0627 1.0627 1.0866 1.0952 1.0945 1.0955 1.0933 1.1024 1.1024 1.1035 1.1032 1.1034 1.0976 1.1021 1.1016 1.0994 1.0794 1.0795
irintensity: 0.1416 0.5520 0.3217 0.2683 1.2342 1.2443 0.5896 0.2587 0.2677 0.9145 0.3127 0.3158 0.8093 3.7847 9.7684 3.0316 2.3870 2.9120 2.7737 5.3241 2.1629 0.8663 0.9762 1.7832 19.0801 38.3547 4.8784 0.5800 0.7184 3.3531 1.8528 17.6986 62.7605 98.1566 33.4399 2.5471 24.6407 37.0905 8.5095 4.1569 11.0547 6.8432 31.9482 19.0969 5.4975 0.3833 2.1550 4.0405 59.4754 9.7091 46.1249 7.1556 0.0070 0.1958 2.3183 0.6543 8.8168 10.6718 15.0127 0.9936 3.2429 7.0064 3.1968 14.9735 9.2356 14.0089 32.1933 43.1054 72.5957 3.7006 20.2759 51.9080 20.0496 122.8389 0.6736 18.7519 4.1165 5.1919 1.0302 0.3401 21.0451 8.2902 8.5279 4.0671 3.2498 2.0489 0.9980 0.6830 3.4054 11.6949 20.4733 29.3937 5.4334 49.8052 54.4575 17.3284 104.5732 181.7713 84.7773 172.5435 0.6846 19.3547 125.5858 0.5896 0.3419 36.8904 68.3554 0.6421 0.7409 4.3995 31.3882 4.0197 8.8402 27.4991 1.2288 18.9074 62.2689 20.5733 7.9096 7.9851 8.3188 29.5683 6.5827 40.9708 7.7566 15.6564 16.3909 19.1308 7.4499 5.4743 4.4532 12.7183 630.0291 497.1621 280.3608 343.5993 108.1828 34.5877 26.4448 32.7550 29.9137 33.1128 36.6184 36.3946 11.4990 14.5634 11.6713 9.6460 35.7738 33.4438 54.3853 70.9785 56.2386 59.2701 49.7068 35.6635 9.5815 36.9409 57.1052 1.0429 9.3616 2.4653 14.3474 32.2692 32.2997
temp: 298.150 k
press: 1.00000 atm
elementType: 8 8 8 8 7 7 7 7 7 6 6 6 6 6 6 6 6 6 6 6 6 6 6 6 6 6 6 6 1 1 1 1 1 1 1 1 1 1 1 1 1 1 1 1 1 1 1 1 1 1 1 1 1 1 1 1 1
symmnumber: 1
zpe: 1251739.4 jmol-1
zpe.correction: 0.476762 hartree
zpe.thermalcorrener: 0.503900 hartree
zpe.thermalcorrenthalpy: 0.504844 hartree
zpe.thermalcorrgfe: 0.417713 hartree
zpe.sumelectzpe: -1314.020741 hartree
zpe.sumelectthermal: -1313.993603 hartree
zpe.sumelectthermalent: -1313.992659 hartree
zpe.sumelectthermalfe: -1314.079790 hartree
dipole: 1.5273 4.7809 0.6181
dipole: 5.0568
quadrupole: -150.1801 -159.9404 -178.1210
quadrupole: 7.5523 0.5726 -4.7732
quadrupole: 12.5670 2.8068 -15.3738 7.5523 0.5726 -4.7732
hfenergy: -1314.4975032 hartree
pointgroup: C01 [X(C19H29N5O4)]
dipole: 0.6649574 -1.8092129 -0.4926924 debye
polarizability: 284.5587182|11.5551413|239.348889|1.8160462|7.8186285|205.2962095 unknown
InChI: InChI=1S/C19H29N5O4/c1-22(12-23-14(25)18(20-16(23)27)8-4-2-5-9-18)13-24-15(26)19(21-17(24)28)10-6-3-7-11-19/h20-21H,2-13H2,1H3
charge 0 multiplicity 1
57 atoms
O  -2.443005 1.152962 -1.963845
O  3.800613 2.296224 0.57468
O  -2.274162 1.373315 2.732711
O  0.056313 -0.540987 1.005926
N  -3.274568 -0.193863 1.237699
N  2.341679 -0.950508 0.506852
N  -2.232736 1.592625 0.352548
N  1.719554 1.185284 0.865308
N  -0.034993 2.703755 0.047329
C  -3.360834 -0.411266 -0.226955
C  3.596959 -0.185569 0.341811
C  -2.613629 -1.700194 -0.679383
C  -4.833124 -0.423071 -0.734508
C  4.677698 -0.576863 1.392388
C  4.176263 -0.298667 -1.09941
C  -3.372277 -2.983487 -0.268736
C  -5.580396 -1.707786 -0.31022
C  5.277223 -1.974386 1.112869
C  4.77602 -1.697004 -1.373445
C  -4.832471 -2.977572 -0.780396
C  5.847326 -2.071323 -0.322029
C  -2.629559 0.848231 -0.755767
C  3.095673 1.255341 0.601128
C  -2.567322 0.940421 1.588872
C  1.239406 -0.166843 0.810949
C  -1.45009 2.854461 0.31015
C  0.866752 2.378419 1.13337
C  0.521256 3.107754 -1.249468
H  -1.596185 -1.685374 -0.250895
H  -2.52053 -1.655017 -1.782035
H  -4.803064 -0.349005 -1.839028
H  -5.355368 0.475178 -0.355126
H  4.233008 -0.537023 2.404374
H  5.472239 0.192837 1.350053
H  4.959881 0.476593 -1.202083
H  3.380552 -0.064704 -1.831484
H  -3.368411 -3.08818 0.83702
H  -2.831646 -3.865883 -0.661462
H  -6.605811 -1.68916 -0.726014
H  -5.691277 -1.728987 0.794067
H  4.500119 -2.754358 1.256944
H  6.06863 -2.185935 1.856419
H  5.213028 -1.712741 -2.38969
H  3.970217 -2.460866 -1.370646
H  -4.828866 -3.006474 -1.889406
H  -5.364108 -3.885105 -0.43547
H  6.708945 -1.379717 -0.41861
H  6.230396 -3.091657 -0.513096
H  -3.516424 -0.895356 1.933997
H  2.263374 -1.961119 0.419634
H  -1.892501 3.479689 -0.483946
H  -1.637371 3.3293 1.291968
H  1.604152 3.184057 1.334053
H  0.272631 2.183792 2.042956
H  0.83233 4.175403 -1.278525
H  -0.226341 2.925894 -2.040626
H  1.409531 2.495415 -1.492469
