program: Gaussian 09
title: 000212641
version: EM64L-G09RevD.01
frameworkgroup: C1[X(C10H20N2)]
method: RPBEPBE
basis: SDD
operation: Freq
keyword: #pfreq=noraman
keyword: PBEPBE/SDD
title: #p freq=noraman PBEPBE/SDD
converged: NO YES NO NO
title: Mulliken charges:
elementType: N N C C C C C C C C C C H H H H H H H H H H H H H H H H H H H H
charge: -0.349950 -0.554574 0.302074 0.353944 -0.206873 -0.175541 -0.537692 -0.514918 -0.476768 -0.823920 -0.791155 -0.792255 0.237210 0.225887 0.242129 0.220407 0.227910 0.207273 0.227799 0.204886 0.207216 0.226847 0.214129 0.234378 0.212411 0.212632 0.238586 0.213005 0.209635 0.264430 0.251667 0.289192
chargesum: 0.00000
title: Mulliken charges with hydrogens summed into heavy atoms:
elementType: N N C C C C C C C C C C
charge: -0.085520 -0.013714 0.302074 0.353944 0.030337 0.050346 -0.075157 -0.079735 -0.044083 -0.175729 -0.131734 -0.131029
polarizability: 1.27146280e+02 -1.91953632e+00 1.10942875e+02 1.69480463e+00 2.85754349e-02 1.09845823e+02
1716.lowfreq: -26.1718 -23.5163 -11.5859 -0.0005 -0.0003 0.0004 81.9620 109.1503 154.4137
frequency: 81.3793 109.0420 154.3489 179.8641 187.1342 203.6886 221.7378 244.9189 267.7765 288.7692 316.7533 348.8361 353.6651 375.9861 414.3065 472.0117 483.7200 517.9897 568.4530 580.0559 640.0314 666.8818 727.4989 758.3107 787.6107 818.6112 830.6041 881.6133 908.6784 932.4590 939.0215 943.0423 953.8785 976.0615 989.5519 1030.3573 1041.6172 1072.2402 1091.5597 1094.6358 1135.7643 1146.5619 1152.0599 1166.4612 1198.7527 1208.0179 1218.8554 1228.5585 1233.5705 1246.3448 1265.3917 1273.0212 1294.0254 1300.6231 1315.3228 1364.6487 1379.2217 1382.3478 1399.1856 1448.0008 1452.9028 1458.7393 1469.8106 1472.3798 1475.3147 1481.8844 1483.7002 1491.2041 1496.9545 1661.7131 2851.3886 2963.7395 2973.4375 2978.1239 2998.3485 3002.4038 3010.0169 3043.8472 3045.8928 3051.3604 3053.8364 3058.6523 3060.9288 3062.9038 3079.8490 3088.9689 3093.4896 3322.0585 3418.6789 3525.1150
redmass: 2.6759 2.1851 1.8023 1.3917 1.2402 1.1019 2.0892 2.3469 2.6481 2.1638 1.8550 2.7677 1.4615 2.5666 2.0924 2.7196 2.3289 2.4621 3.8669 3.2654 3.2071 1.9712 2.3157 1.3518 2.0390 1.8728 1.9246 2.3014 2.2422 1.6649 1.6343 1.5086 2.0005 2.3378 1.4172 1.7211 2.1807 1.4685 1.5664 1.5082 2.7798 2.5106 2.0093 1.9168 1.9708 1.7868 2.0100 1.7938 1.3953 1.5795 1.8641 1.4502 1.5005 1.6546 1.9652 1.2707 1.2136 1.2322 1.1945 1.1392 1.0717 1.0698 1.0633 1.0560 1.0567 1.0660 1.0681 1.0634 1.0612 1.0653 1.0818 1.0362 1.0378 1.0377 1.0608 1.0606 1.0640 1.0891 1.0969 1.0992 1.1029 1.0978 1.0989 1.1023 1.1018 1.0964 1.0961 1.0504 1.0753 1.0897
irintensity: 0.6531 1.3984 2.0068 1.0454 1.6294 0.1658 1.3007 0.1556 1.7241 3.1427 4.1596 1.4806 15.5093 1.8703 0.0516 0.4900 20.9922 20.4124 1.8778 3.3804 5.1108 163.8124 20.3151 85.5484 17.0578 3.9093 2.2937 1.2434 0.9899 4.7278 2.0908 1.8752 2.2100 1.5644 0.9445 1.3323 5.6048 5.1158 0.9096 2.4407 7.4344 22.1094 3.0583 0.7055 4.1700 6.3072 3.0176 1.7174 9.8869 0.8856 0.7158 1.6148 0.2656 2.8260 3.4460 17.6426 7.0314 14.8931 27.2872 2.4952 4.2816 0.3319 21.0392 13.7353 1.9882 3.9528 11.1876 9.8399 7.3240 20.2505 83.4463 35.8429 22.6591 57.0906 39.0991 27.9548 61.8773 38.5669 47.9934 1.1641 16.9340 65.7985 22.0587 37.5728 48.1264 52.1258 24.1640 26.2882 1.5497 1.2881
temp: 298.150 k
press: 1.00000 atm
elementType: 7 7 6 6 6 6 6 6 6 6 6 6 1 1 1 1 1 1 1 1 1 1 1 1 1 1 1 1 1 1 1 1
symmnumber: 1
zpe: 756273.7 jmol-1
zpe.correction: 0.288049 hartree
zpe.thermalcorrener: 0.300967 hartree
zpe.thermalcorrenthalpy: 0.301911 hartree
zpe.thermalcorrgfe: 0.250811 hartree
zpe.sumelectzpe: -501.537370 hartree
zpe.sumelectthermal: -501.524452 hartree
zpe.sumelectthermalent: -501.523508 hartree
zpe.sumelectthermalfe: -501.574608 hartree
dipole: -1.1269 0.1891 1.3625
dipole: 1.7782
quadrupole: -81.6128 -74.2098 -75.1320
quadrupole: -1.4551 4.6927 -1.0747
quadrupole: -4.6279 2.7750 1.8529 -1.4551 4.6927 -1.0747
hfenergy: -501.8254192 hartree
pointgroup: C01 [X(C10H20N2)]
dipole: -0.4395775 -0.0052847 -0.5442227 debye
polarizability: 127.348189|1.1471362|110.7539886|-1.3683497|0.2128247|109.8328002 unknown
InChI: InChI=1S/C10H20N2/c1-9(2)7-4-5-10(9,3)8(6-7)12-11/h7-8,12H,4-6,11H2,1-3H3
charge 0 multiplicity 1
32 atoms
N  2.325333 -0.495085 0.409058
N  3.555602 -0.314551 -0.319446
C  -0.212903 -0.749168 0.372791
C  -1.321856 0.013072 -0.473842
C  -0.633267 1.412422 -0.274775
C  1.089437 -0.33171 -0.400362
C  -0.220527 0.057205 1.717164
C  0.814567 1.162004 -0.797698
C  -0.545418 1.528748 1.275891
C  -0.386945 -2.263147 0.544157
C  -1.435645 -0.427911 -1.955919
C  -2.743445 -0.083319 0.132868
H  -1.145372 2.260871 -0.761645
H  1.165198 -0.960322 -1.323629
H  0.76103 -0.011209 2.214211
H  -0.983247 -0.345679 2.408611
H  0.895014 1.320827 -1.88774
H  1.54076 1.832631 -0.303794
H  -1.4968 1.886205 1.709543
H  0.243998 2.237917 1.582163
H  0.404448 -2.694874 1.187594
H  -1.354514 -2.501714 1.023855
H  -0.348629 -2.791396 -0.427758
H  -0.498637 -0.31785 -2.526081
H  -1.749429 -1.487101 -2.026008
H  -2.207762 0.176345 -2.469338
H  -2.77067 0.11733 1.216242
H  -3.417649 0.642543 -0.360644
H  -3.168748 -1.091498 -0.031983
H  2.359546 -1.413798 0.873169
H  3.521965 -0.663781 -1.293844
H  3.861865 0.662888 -0.276008
