program: Gaussian 09
title: 000212629
version: EM64L-G09RevD.01
frameworkgroup: C1[X(C12H14ClNO3S)]
method: RPBEPBE
basis: SDD
operation: Freq
keyword: #p
keyword: freq=noraman
keyword: PBEPBE/SDD
title: #p freq=noraman PBEPBE/SDD
converged: YES YES NO NO
title: Mulliken charges:
elementType: Cl S O O O N C C C C C C C C C C C C H H H H H H H H H H H H H H
charge: -0.057800 0.163102 -0.245354 -0.297901 -0.276257 -0.616761 -0.280341 -0.079573 -0.696959 0.535373 -0.659187 -0.285586 -0.360563 -0.378530 -0.212838 -0.213140 -0.111785 0.296048 0.279720 0.280298 0.281074 0.247061 0.226209 0.232337 0.250927 0.256197 0.249797 0.278007 0.255262 0.257865 0.339618 0.343683
chargesum: 0.00000
title: Mulliken charges with hydrogens summed into heavy atoms:
elementType: Cl S O O O N C C C C C C C C C C C C
charge: -0.057800 0.163102 -0.245354 -0.297901 -0.276257 0.066540 -0.280341 0.200146 -0.135588 0.535373 0.046420 0.221538 -0.110766 -0.100523 0.042424 0.044725 -0.111785 0.296048
polarizability: 2.11186245e+02 1.88940427e+01 1.57924515e+02 4.22473823e+00 -1.15162564e+01 1.41026689e+02
1716.lowfreq: -6.6409 -2.9675 -0.0016 -0.0016 0.0002 2.0135 20.1130 32.1637 41.6555
frequency: 19.9910 32.0510 41.6188 52.7828 71.1766 87.8483 92.2478 130.6473 188.8507 212.4409 223.2066 235.7647 241.3880 283.9052 299.9511 311.3409 353.3387 363.8040 407.5513 413.8690 444.3624 464.5014 492.2768 507.3373 521.7149 524.0109 550.5038 607.0164 625.6865 633.8291 675.6289 703.5201 710.1556 724.6533 767.2378 789.4165 828.1608 833.8889 841.3844 857.2711 899.4592 951.7363 976.6812 978.6651 999.5413 1010.1820 1034.3931 1058.2668 1064.9915 1068.8757 1074.7881 1081.1790 1101.5221 1116.3225 1175.0121 1184.2863 1214.8293 1231.1183 1267.1166 1291.3346 1301.7483 1304.6718 1332.2823 1363.4613 1375.7277 1385.1633 1389.0248 1442.7022 1448.8365 1453.3842 1456.2943 1473.3540 1582.2403 1588.9086 1595.7855 1692.9051 2993.3858 3041.9380 3043.7889 3061.4396 3093.0417 3116.1102 3122.4526 3127.6839 3138.8100 3152.5354 3170.1691 3174.1492 3557.4607 3714.6421
redmass: 8.3538 5.5371 5.2768 5.5945 5.0106 6.6264 4.3737 8.8029 5.7690 3.1221 3.9328 2.1244 1.7404 4.1784 3.5398 4.6781 4.7565 5.0896 2.9535 3.2597 5.6483 4.0263 3.8022 1.1563 1.0822 5.8777 3.3053 6.3037 7.1357 5.4433 5.5697 11.2724 4.0532 3.5118 3.9722 4.1076 1.3907 2.5526 1.4362 2.8319 1.8140 1.3580 3.0908 1.3730 4.0641 8.4617 1.7228 1.9800 1.7900 2.7559 1.9815 1.7525 4.4681 1.4271 1.5856 1.1191 1.3050 3.8302 1.2329 1.2496 2.2781 1.2245 1.5537 5.6039 1.3723 1.2089 3.6909 1.0960 1.0918 1.0518 1.0856 2.2038 7.7209 1.2055 6.3051 7.4299 1.0357 1.0591 1.0579 1.0839 1.0986 1.1012 1.1091 1.1088 1.0892 1.0883 1.0955 1.0970 1.0446 1.1058
irintensity: 0.2628 3.0094 2.9283 3.1012 2.6711 0.1296 1.2025 0.3007 1.0228 6.5696 0.5033 7.6088 1.0271 2.7190 14.4927 1.9789 5.1270 6.0461 0.0919 5.2874 21.1044 11.9149 2.1065 243.8070 68.8073 9.2191 32.5290 4.3070 2.0994 2.7706 6.5968 32.2119 7.5804 10.5443 36.8682 28.9136 27.2602 7.0586 33.2456 7.7091 16.4870 0.5407 89.8324 11.7453 40.1480 149.9888 3.8475 53.5196 11.1070 4.4207 77.3038 15.5029 72.0679 1.3456 35.4380 2.2643 10.7426 52.3201 9.8685 3.2155 338.3085 3.3239 74.6050 4.1364 45.9792 20.1619 7.6562 26.5074 7.4210 12.3920 2.2300 72.4900 3.7839 109.2494 15.1530 337.0270 14.4524 30.7822 0.6636 19.3748 12.4305 19.7929 6.4663 4.1185 4.8302 0.8132 4.5554 1.0305 75.3569 53.0470
temp: 298.150 k
press: 1.00000 atm
elementType: 17 16 8 8 8 7 6 6 6 6 6 6 6 6 6 6 6 6 1 1 1 1 1 1 1 1 1 1 1 1 1 1
symmnumber: 1
zpe: 637853.2 jmol-1
zpe.correction: 0.242945 hartree
zpe.thermalcorrener: 0.261003 hartree
zpe.thermalcorrenthalpy: 0.261947 hartree
zpe.thermalcorrgfe: 0.194456 hartree
zpe.sumelectzpe: -1602.887551 hartree
zpe.sumelectthermal: -1602.869493 hartree
zpe.sumelectthermalent: -1602.868549 hartree
zpe.sumelectthermalfe: -1602.936041 hartree
dipole: 3.1906 0.2264 -2.0099
dipole: 3.7777
quadrupole: -108.1291 -118.5188 -120.9789
quadrupole: -11.3184 -11.4827 5.1536
quadrupole: 7.7465 -2.6432 -5.1033 -11.3184 -11.4827 5.1536
hfenergy: -1603.1304963 hartree
pointgroup: C01 [X(C12H14Cl1N1O3S1)]
dipole: 1.232413 -0.6903901 0.4620447 debye
polarizability: 201.8891714|-19.0250327|168.3484326|-21.5460632|7.6959739|139.8998451 unknown
InChI: InChI=1S/C12H14ClNO3S/c1-12(8-2-4-9(13)5-3-8)17-10(7-18-12)6-16-11(14)15/h2-5,10H,6-7,14H2,1H3
charge 0 multiplicity 1
32 atoms
Cl -4.432981 2.240312 2.087916
S  0.168007 -2.765849 -0.203797
O  0.567654 -0.512167 -1.724743
O  2.959824 0.156428 1.139795
O  3.889253 1.790238 -0.29339
N  5.08409 0.875192 1.512183
C  -0.586733 -1.271655 -1.22663
C  1.769412 -0.653569 -0.875772
C  1.920082 -2.150621 -0.550266
C  -1.49424 -0.410669 -0.340678
C  -1.33229 -1.799727 -2.460594
C  1.687903 0.241505 0.38082
C  -2.346998 -0.985957 0.633169
C  -1.562093 0.986851 -0.571216
C  -3.244967 -0.187774 1.375196
C  -2.450523 1.801394 0.165951
C  -3.280787 1.198336 1.128784
C  3.987607 1.021161 0.693838
H  2.596863 -0.295633 -1.512202
H  2.337784 -2.707934 -1.402197
H  2.530501 -2.307529 0.353136
H  -0.660262 -2.42785 -3.066768
H  -2.209291 -2.396829 -2.158654
H  -1.684157 -0.948827 -3.072325
H  0.922897 -0.110208 1.089827
H  1.50101 1.286776 0.083236
H  -2.298496 -2.061406 0.836853
H  -0.910214 1.435993 -1.327149
H  -3.896933 -0.633795 2.131724
H  -2.494889 2.880325 -0.008195
H  5.052736 0.245438 2.310253
H  5.911833 1.433049 1.322693
