program: Gaussian 09
title: 000212626
version: EM64L-G09RevD.01
frameworkgroup: C1[X(C12H15NO3S)]
method: RPBEPBE
basis: SDD
operation: Freq
keyword: #p
keyword: freq=noraman
keyword: PBEPBE/SDD
title: #p freq=noraman PBEPBE/SDD
converged: YES YES NO NO
title: Mulliken charges:
elementType: S O O O N C C C C C C C C C C C C H H H H H H H H H H H H H H H
charge: 0.184338 -0.264300 -0.290486 -0.288943 -0.616774 -0.264673 0.019821 -0.756288 0.504700 -0.681798 -0.331550 -0.366591 -0.381192 -0.229833 -0.227301 -0.241275 0.303767 0.238238 0.322205 0.284695 0.246680 0.226383 0.235438 0.246431 0.252493 0.248935 0.265218 0.226106 0.226219 0.228392 0.338612 0.342331
chargesum: 0.00000
title: Mulliken charges with hydrogens summed into heavy atoms:
elementType: S O O O N C C C C C C C C C C C C
charge: 0.184338 -0.264300 -0.290486 -0.288943 0.064170 -0.264673 0.258059 -0.149388 0.504700 0.026704 0.167373 -0.117656 -0.115974 -0.003727 -0.001082 -0.012883 0.303767
polarizability: 1.90723882e+02 3.91234892e+00 1.51773519e+02 5.40472397e+00 -1.21316195e+01 1.29278488e+02
1716.lowfreq: -11.2162 -8.8141 -0.0018 -0.0016 0.0001 1.6927 19.9382 25.4620 37.3766
frequency: 19.7736 25.1208 37.3163 55.0732 78.2675 101.5849 146.5805 163.1018 203.1076 222.5025 254.7766 262.3242 280.3573 288.4140 316.9872 389.3071 403.2514 406.4822 453.4379 482.2919 503.1418 523.6659 530.8648 555.7172 598.0501 613.8187 617.4552 646.1935 702.6818 706.1853 714.8623 755.7774 773.1601 791.1979 842.7606 857.1549 857.9122 893.9985 929.0024 954.3291 981.7711 989.5755 997.7500 1004.0995 1023.2178 1053.3598 1060.6652 1066.6511 1074.6512 1082.9082 1102.9783 1121.6637 1170.6817 1182.7931 1183.9683 1213.5167 1231.2793 1258.9112 1275.0733 1300.6510 1308.5510 1333.7511 1374.9437 1379.0832 1389.3654 1431.0224 1442.1028 1454.1904 1457.7709 1462.1128 1475.8669 1586.9815 1588.4907 1607.8401 1684.6750 2998.9765 3003.9407 3036.4116 3040.5651 3098.5533 3114.2251 3120.9553 3122.0945 3124.6443 3129.7766 3142.6696 3154.0406 3165.2451 3557.8782 3715.8330
redmass: 5.4774 5.1881 5.1746 5.5895 4.9518 4.5114 4.4396 5.1313 2.9022 1.2456 4.1267 3.1880 3.2905 4.1703 5.0257 2.5669 2.9777 5.8712 3.6175 3.4678 1.1697 1.0719 4.8076 3.7117 5.8657 5.7640 5.9403 5.3735 10.5199 1.9265 4.4348 3.7974 1.8993 4.0349 2.8843 2.9454 1.2634 1.6319 1.4019 4.8765 1.4705 4.6343 1.3261 5.2799 2.4066 1.8633 1.8177 1.7071 1.7771 1.8935 1.7542 4.2145 1.0535 1.1781 1.3323 1.3171 2.8875 1.2337 1.2520 2.0094 1.3393 1.7509 1.4682 8.5346 1.2135 2.2068 1.0824 1.0963 1.0592 1.0887 2.0352 1.2509 5.5169 6.1033 6.9360 1.0351 1.0835 1.0594 1.0588 1.0994 1.1012 1.1084 1.0846 1.1081 1.0879 1.0930 1.0953 1.1006 1.0445 1.1059
irintensity: 1.9402 1.3289 2.2682 0.2863 5.4224 2.6884 3.9627 2.7384 1.3768 0.3447 6.8855 5.4884 8.0994 7.1569 21.0820 1.9997 0.3023 1.3766 3.8603 5.9186 277.6690 44.8920 9.5722 10.8744 5.4702 1.1171 3.5831 16.4471 34.2938 40.8973 39.3410 16.2667 33.5352 14.6273 12.9978 4.4701 0.1181 5.9768 2.6304 70.1717 1.3372 0.0505 3.7254 191.0402 9.5099 56.5345 11.1249 13.6066 16.5309 8.0534 7.0843 77.7317 0.3355 6.0800 7.5038 8.4257 61.6670 24.4422 0.6564 266.3106 3.4227 100.7941 51.4660 0.8854 20.0079 13.7056 22.8782 19.3681 3.5889 6.9574 14.3378 88.8321 4.5004 1.9652 372.6027 14.1655 17.2563 12.0095 24.5011 10.6593 21.9740 8.3225 0.8488 4.4832 5.0183 20.9424 24.5460 20.3065 77.3172 52.3710
temp: 298.150 k
press: 1.00000 atm
elementType: 16 8 8 8 7 6 6 6 6 6 6 6 6 6 6 6 6 1 1 1 1 1 1 1 1 1 1 1 1 1 1 1
symmnumber: 1
zpe: 662950.8 jmol-1
zpe.correction: 0.252505 hartree
zpe.thermalcorrener: 0.269265 hartree
zpe.thermalcorrenthalpy: 0.270209 hartree
zpe.thermalcorrgfe: 0.205837 hartree
zpe.sumelectzpe: -1143.497648 hartree
zpe.sumelectthermal: -1143.480889 hartree
zpe.sumelectthermalent: -1143.479944 hartree
zpe.sumelectthermalfe: -1143.544316 hartree
dipole: 0.9835 -3.2534 0.7652
dipole: 3.4839
quadrupole: -86.3044 -101.7878 -109.4700
quadrupole: -12.7643 4.1519 2.9838
quadrupole: 12.8830 -2.6004 -10.2826 -12.7643 4.1519 2.9838
hfenergy: -1143.750153 hartree
pointgroup: C01 [X(C12H15N1O3S1)]
dipole: -0.4304734 1.3005686 -0.0443894 debye
polarizability: 191.1073095|3.2698381|156.2936139|-0.823099|5.7248097|124.3749662 unknown
InChI: InChI=1S/C12H15NO3S/c1-12(9-5-3-2-4-6-9)16-10(8-17-12)7-15-11(13)14/h2-6,10H,7-8,13H2,1H3
charge 0 multiplicity 1
32 atoms
S  0.186995 -2.129433 -0.515877
O  -0.154282 -0.221283 1.354899
O  -3.583039 0.573871 0.278242
O  -4.013049 -1.055408 -1.383946
N  -5.297103 0.897813 -1.172341
C  0.97039 -1.02888 0.869798
C  -1.131557 0.136047 0.28675
C  -0.756366 -0.580173 -1.033729
C  2.089025 -0.143284 0.303977
C  1.439548 -1.902395 2.038971
C  -2.503216 -0.263018 0.861933
C  3.109182 -0.688496 -0.516325
C  2.155037 1.225613 0.665509
C  4.172947 0.121231 -0.969308
C  3.217184 2.038219 0.206386
C  4.230413 1.489389 -0.611269
C  -4.283087 0.035979 -0.821509
H  -1.104169 1.234442 0.14799
H  -1.652494 -0.89345 -1.591247
H  -0.096189 0.038221 -1.661077
H  0.607832 -2.527649 2.402326
H  2.277716 -2.549831 1.730373
H  1.790211 -1.25383 2.861161
H  -2.525218 -0.034504 1.938297
H  -2.71284 -1.332559 0.685246
H  3.049335 -1.739571 -0.82131
H  1.373753 1.639269 1.311511
H  4.952258 -0.310706 -1.607445
H  3.253398 3.096511 0.489379
H  5.053941 2.118182 -0.968068
H  -5.454669 1.751444 -0.642352
H  -5.892086 0.655539 -1.959348
