program: Gaussian 09
title: 000212618
version: EM64L-G09RevD.01
frameworkgroup: C1[X(C3HCl5O2)]
method: RPBEPBE
basis: SDD
operation: Freq
keyword: #p
keyword: freq=noraman
keyword: PBEPBE/SDD
title: #p freq=noraman PBEPBE/SDD
converged: YES YES NO NO
title: Mulliken charges:
elementType: Cl Cl Cl Cl Cl O O C C C H
charge: 0.153386 0.133678 0.171876 0.144452 0.171677 -0.371745 -0.162329 -0.430044 -0.553920 0.340114 0.402855
chargesum: 0.00000
title: Mulliken charges with hydrogens summed into heavy atoms:
elementType: Cl Cl Cl Cl Cl O O C C C
charge: 0.153386 0.133678 0.171876 0.144452 0.171677 0.031110 -0.162329 -0.430044 -0.553920 0.340114
polarizability: 7.34471795e+01 -3.07714041e+00 9.16505466e+01 -7.35798869e+00 -7.25192406e+00 9.20586419e+01
1716.lowfreq: -13.5982 -9.5743 -1.3370 0.0009 0.0025 0.0042 16.4598 68.9139 135.7118
frequency: 16.1625 68.8993 135.7098 155.0227 176.7323 201.3265 210.1688 230.9086 257.5189 293.0027 307.8541 321.6825 380.1675 382.4074 522.4049 589.8976 632.4556 686.3788 709.6768 751.8048 794.1624 895.2869 995.5814 1058.0636 1302.7997 1666.6680 3519.3947
redmass: 13.5374 22.3926 15.2680 21.3707 22.0094 24.0714 22.3270 19.8997 25.3077 19.2359 25.2923 17.8346 26.6943 14.4597 2.4113 2.8711 2.4312 12.2179 12.9839 9.7928 12.0520 12.0507 11.9647 2.7833 2.1090 11.1476 1.0644
irintensity: 1.2254 0.0918 0.7765 0.3016 0.1206 0.4375 0.2948 0.3034 0.0068 0.0790 0.3728 0.6711 1.0701 2.5372 21.1484 128.0353 170.3387 81.3510 177.2912 41.0629 24.3917 6.7872 7.7604 207.5951 30.4053 180.8086 51.3166
temp: 298.150 k
press: 1.00000 atm
elementType: 17 17 17 17 17 8 8 6 6 6 1
symmnumber: 1
zpe: 103250.5 jmol-1
zpe.correction: 0.039326 hartree
zpe.thermalcorrener: 0.050799 hartree
zpe.thermalcorrenthalpy: 0.051743 hartree
zpe.thermalcorrgfe: -0.000432 hartree
zpe.sumelectzpe: -2564.859439 hartree
zpe.sumelectthermal: -2564.847967 hartree
zpe.sumelectthermalent: -2564.847022 hartree
zpe.sumelectthermalfe: -2564.899197 hartree
dipole: -0.6349 1.9517 -0.3044
dipole: 2.0749
quadrupole: -90.5795 -85.4921 -93.0785
quadrupole: -7.0535 1.8787 2.0715
quadrupole: -0.8628 4.2246 -3.3618 -7.0535 1.8787 2.0715
hfenergy: -2564.8987655 hartree
pointgroup: C01 [X(C3H1Cl5O2)]
dipole: 0.4084528 -0.6643427 -0.2412186 debye
dipolederiv: -0.0865218 -0.0354936 0.0273971 -0.0392525 -0.4326265 -0.2249352 0.0303512 -0.1516425 -0.1905858 -0.134891 -0.0221844 0.0514129 -0.0370636 -0.1001087 0.0816774 0.0702197 0.0080962 -0.6000609 -0.5732899 0.2742229 -0.1306802 0.245518 -0.2719547 0.0784065 -0.1095444 0.0771274 -0.1264319 -0.1764142 -0.0278362 0.0211097 -0.0050502 -0.1524283 0.1417738 -0.0471048 0.1179659 -0.7120304 -0.1078279 -0.0766887 -0.0203611 0.0238072 -0.5840239 -0.2477408 0.0230413 -0.2340038 -0.2313015 -0.4173667 0.2677527 0.1833015 0.2059624 -0.9016823 -0.2825206 0.1472906 -0.2636488 -0.4487822 -0.6756889 -0.0716567 -0.3111661 0.1012655 -0.468985 -0.0951049 -0.2012814 -0.2305957 -0.5159625 0.0126634 0.1770153 -0.1772769 0.1467268 0.5624083 0.1506809 -0.2598663 0.185745 0.8237267 0.9225165 -0.1792859 0.1216167 -0.2323079 1.0171544 0.0427368 0.1641028 0.0472684 1.06703 1.0259384 -0.3268814 0.3458613 -0.4105165 0.9668441 0.3693603 0.3340467 0.4477166 0.6433565 0.2108821 0.0210362 -0.1112148 0.0009108 0.3654026 -0.0143342 -0.1512553 -0.0040289 0.2910421 unknown
polarizability: 76.701095|-6.9505235|86.9405002|5.8112683|8.6781418|93.5147729 unknown
InChI: InChI=1S/C3HCl5O2/c4-2(5,1(9)10)3(6,7)8/h9H
charge 0 multiplicity 1
11 atoms
Cl 0.076192 2.193623 0.528072
Cl 0.263605 0.766777 -2.121665
Cl -2.646426 0.630972 -0.312676
Cl -1.059589 -0.649301 1.931854
Cl -1.170847 -1.927745 -0.79574
O  1.785202 -1.27876 -0.524557
O  2.261007 0.317022 1.090548
C  0.180557 0.521511 -0.27083
C  -1.103385 -0.307178 0.096183
C  1.521195 -0.131306 0.201931
H  2.641088 -1.681313 -0.21292
