program: Gaussian 09
title: 000212614
version: EM64L-G09RevD.01
frameworkgroup: C1[X(C20H25NO2)]
method: RPBEPBE
basis: SDD
operation: Freq
keyword: #p
keyword: freq=noraman
keyword: PBEPBE/SDD
title: #p freq=noraman PBEPBE/SDD
converged: YES YES NO NO
title: Mulliken charges:
elementType: O O N C C C C C C C C C C C C C C C C C C C C H H H H H H H H H H H H H H H H H H H H H H H H H
charge: -0.263252 -0.304283 -0.092845 -0.353726 -0.371142 -0.393575 -0.391938 -0.397936 -0.341724 -0.446248 -0.285032 0.277460 0.144870 -0.343091 -0.334949 -0.238740 -0.233007 0.383404 -0.350052 -0.389132 -0.219891 -0.194665 -0.267096 0.202424 0.169614 0.165940 0.236995 0.191223 0.199817 0.190446 0.201153 0.212866 0.189379 0.245325 0.188782 0.223210 0.194581 0.207096 0.236377 0.253485 0.256037 0.224450 0.229351 0.256404 0.254081 0.224392 0.225939 0.227225
chargesum: 0.00000
title: Mulliken charges with hydrogens summed into heavy atoms:
elementType: O O N C C C C C C C C C C C C C C C C C C C C
charge: -0.263252 -0.304283 -0.092845 0.018311 0.031793 -0.002536 -0.000339 0.004309 0.092383 -0.028456 0.158442 0.277460 0.144870 -0.089607 -0.078912 -0.014290 -0.003656 0.383404 -0.093648 -0.135051 0.004501 0.031274 -0.039871
polarizability: 2.38123495e+02 2.05536185e+01 2.48503103e+02 5.16497290e+00 1.86198334e+01 1.85126477e+02
1716.lowfreq: -18.0528 -7.4196 -1.8783 -0.0009 -0.0007 -0.0003 6.5035 21.2498 28.0624
frequency: -12.4008 21.2124 27.9632 37.2237 47.3732 62.6238 74.1223 99.7349 104.4425 167.0972 180.2450 195.2433 207.2288 235.5667 277.4652 287.1822 295.1720 308.5933 328.6825 372.2716 395.0023 410.1949 411.9213 440.0109 450.4354 485.8601 491.5899 500.3548 532.8409 534.8378 561.7643 593.1875 601.7307 617.0513 689.3542 709.6573 720.9245 741.6876 754.3841 760.8093 772.2871 803.7782 823.1606 832.2061 842.8811 846.3557 852.4455 861.0247 891.6031 897.2789 906.0093 925.3470 936.1903 957.9375 964.1819 967.1663 980.7704 982.5206 984.9532 1017.9406 1019.0614 1035.1590 1040.3218 1057.8054 1076.3136 1080.5278 1094.8073 1109.1596 1118.4027 1123.1168 1149.1676 1153.5357 1157.1006 1165.3121 1167.2693 1175.5434 1184.3779 1198.8703 1205.9266 1246.7062 1255.5934 1264.9354 1265.7803 1268.4728 1288.3071 1292.8870 1307.2131 1328.9252 1338.2301 1342.0273 1346.5343 1351.8237 1364.9665 1369.1743 1381.5488 1387.2830 1391.8896 1434.2801 1442.9294 1445.5076 1451.1784 1460.1863 1462.7957 1463.4125 1467.5831 1470.0059 1473.5053 1484.4258 1487.7379 1582.4891 1595.2451 1600.7096 1613.6874 2817.7151 2827.9890 2865.6294 2963.6022 2965.4405 2982.9365 2983.1732 2998.1311 3027.5001 3029.4847 3033.1768 3035.5246 3043.1766 3045.1480 3052.2893 3060.5481 3124.2442 3134.1242 3135.1177 3150.6017 3152.9913 3161.4611 3163.0269 3172.3507 3174.3773
redmass: 4.0231 4.4381 4.7155 3.3546 3.8828 4.6676 4.3419 4.5051 3.5756 3.9381 4.6609 2.4335 3.8459 1.8556 2.9783 3.9811 3.4474 5.0887 2.3022 2.6512 1.8878 2.9579 2.6605 3.8518 2.8582 3.5308 3.2216 2.8862 3.9244 2.0153 4.7124 5.5200 5.2593 6.0716 2.2919 3.1012 3.4715 2.5768 1.3745 2.0084 3.4050 1.4716 2.3005 1.2526 1.6904 2.9256 1.5721 2.6054 2.6368 1.4386 2.3031 1.3856 3.1041 1.3087 1.3570 1.3061 1.3480 2.1210 5.7840 2.0889 2.0524 2.0268 2.0551 1.8303 1.5038 1.6135 2.3954 2.0313 2.2441 2.7465 1.4024 1.9047 1.6749 1.1577 1.0786 1.4907 1.2864 2.4867 1.1890 3.0883 1.4218 1.4274 1.2983 1.4201 1.1676 1.4199 1.3287 1.2742 1.4007 1.4511 1.5038 1.3783 1.6600 1.4572 3.6550 7.8825 1.4765 2.3440 2.3289 1.0932 1.0913 1.0907 1.2060 1.1330 1.1025 2.2685 1.0899 1.2582 1.6570 6.8037 6.6755 6.6910 6.6864 1.0713 1.0701 1.0709 1.0555 1.0627 1.0625 1.0598 1.0627 1.0878 1.0913 1.1035 1.0925 1.1031 1.0924 1.1036 1.0981 1.0852 1.0856 1.0887 1.0899 1.0928 1.0963 1.0940 1.0996 1.1002
irintensity: 0.1885 0.0086 0.1516 0.7096 0.0851 0.9577 0.6887 0.9754 0.4509 0.6218 1.3151 5.0488 1.0192 0.2215 1.8084 0.7772 0.6221 7.4681 2.9088 0.5272 4.1716 0.2371 1.4818 5.4852 0.3335 3.3833 11.5603 0.0979 1.6785 2.2681 0.5419 0.8459 0.5292 1.1356 25.6316 10.6622 12.1646 19.6405 126.2421 40.1069 23.4184 0.1195 7.7643 0.1005 4.0483 12.6459 10.2753 4.0460 0.4524 7.9193 1.2444 5.4378 84.0980 1.5316 0.3289 0.1117 1.7954 12.7118 0.9945 6.0999 16.2369 19.6992 8.4008 8.4139 9.6197 12.0047 75.7918 9.5226 13.9795 6.6988 11.7368 22.0853 14.5994 20.2545 1.0887 24.7125 3.7009 136.4299 31.7182 293.4701 20.1530 15.1141 5.7849 11.3988 8.1919 10.6625 0.6544 5.0197 0.4190 5.5199 2.4803 2.7322 8.6639 3.5313 12.4454 3.1247 2.7772 23.4486 2.5769 17.2986 5.6019 6.2905 86.5613 26.7631 14.0134 156.3919 1.9078 50.0153 39.2623 14.4482 19.0620 36.6144 58.3083 54.7493 109.2896 136.5541 32.7351 40.4549 24.0708 42.3354 25.6924 65.2614 61.1960 28.0767 9.9248 23.7504 20.8789 100.5597 41.9759 3.8325 2.4028 13.5159 17.9836 22.6793 16.8802 18.2675 10.6233 12.1935
temp: 298.150 k
press: 1.00000 atm
elementType: 8 8 7 6 6 6 6 6 6 6 6 6 6 6 6 6 6 6 6 6 6 6 6 1 1 1 1 1 1 1 1 1 1 1 1 1 1 1 1 1 1 1 1 1 1 1 1 1
symmnumber: 1
zpe: 1064189.5 jmol-1
zpe.correction: 0.405328 hartree
zpe.thermalcorrener: 0.425596 hartree
zpe.thermalcorrenthalpy: 0.426541 hartree
zpe.thermalcorrgfe: 0.354787 hartree
zpe.sumelectzpe: -980.579003 hartree
zpe.sumelectthermal: -980.558735 hartree
zpe.sumelectthermalent: -980.557791 hartree
zpe.sumelectthermalfe: -980.629544 hartree
dipole: 2.5622 -1.1458 -0.3632
dipole: 2.8301
quadrupole: -135.7268 -126.9449 -134.3161
quadrupole: 3.0288 4.7040 1.6835
quadrupole: -3.3975 5.3843 -1.9868 3.0288 4.7040 1.6835
hfenergy: -980.9843313 hartree
pointgroup: C01 [X(C20H25N1O2)]
dipole: -0.8417896 0.547166 -0.4814642 debye
polarizability: 250.0851833|13.0593093|210.3954197|-18.2241779|-30.57642|211.2724724 unknown
InChI: InChI=1S/C20H25NO2/c1-3-10-18(11-4-1)23-20-13-6-5-12-19(20)22-17-9-16-21-14-7-2-8-15-21/h1,3-6,10-13H,2,7-9,14-17H2
charge 0 multiplicity 1
48 atoms
O  1.058883 1.109525 0.614693
O  2.734649 -0.969161 1.314419
N  -2.614091 1.064426 -0.157426
C  -3.746804 2.025539 -0.153946
C  -3.056864 -0.281467 -0.609767
C  -4.368518 2.162769 -1.559351
C  -3.651871 -0.220155 -2.031091
C  -4.824654 0.785115 -2.090801
C  -1.898524 1.015561 1.143814
C  -0.9532 2.22121 1.34545
C  0.173277 2.258965 0.312848
C  2.191421 0.926945 -0.174944
C  3.025534 -0.177449 0.17351
C  2.567661 1.749759 -1.265499
C  4.213332 -0.431149 -0.533014
C  3.760672 1.483969 -1.977604
C  4.5899 0.401218 -1.61401
C  1.611554 -1.831641 1.300782
C  0.905862 -2.174489 0.124715
C  1.260254 -2.391301 2.55018
C  -0.166757 -3.091141 0.212362
C  0.187591 -3.304823 2.620382
C  -0.533006 -3.66025 1.453945
H  -3.381892 3.010186 0.191594
H  -4.542457 1.697482 0.568688
H  -3.826172 -0.708852 0.087951
H  -2.182609 -0.957298 -0.585691
H  -5.221061 2.868107 -1.517745
H  -3.610657 2.590919 -2.243995
H  -3.987943 -1.230952 -2.333636
H  -2.858014 0.095429 -2.735949
H  -5.209325 0.874472 -3.124543
H  -5.661303 0.409977 -1.465083
H  -1.290033 0.093572 1.168187
H  -2.612018 0.960632 2.004295
H  -0.512973 2.173474 2.359454
H  -1.515691 3.172878 1.280069
H  0.760961 3.196466 0.385678
H  -0.244782 2.146861 -0.707152
H  1.940858 2.597361 -1.556906
H  4.831316 -1.278603 -0.220159
H  4.03943 2.132345 -2.815534
H  5.516718 0.202115 -2.161179
H  1.191849 -1.739877 -0.838362
H  1.830088 -2.1030 3.438608
H  -0.710759 -3.366214 -0.698947
H  -0.085633 -3.740017 3.58826
H  -1.363899 -4.371238 1.512351
