program: Gaussian 09
title: 000212608
version: EM64L-G09RevD.01
frameworkgroup: C1[X(C17H21NO2)]
method: RPBEPBE
basis: SDD
operation: Freq
keyword: #p
keyword: freq=noraman
keyword: PBEPBE/SDD
title: #p freq=noraman PBEPBE/SDD
converged: YES YES NO NO
title: Mulliken charges:
elementType: O O N C C C C C C C C C C C C C C C C C H H H H H H H H H H H H H H H H H H H H H
charge: -0.261107 -0.305803 -0.083834 -0.421515 -0.331122 -0.298639 -0.625522 -0.619408 0.275682 0.148993 -0.342437 -0.337729 -0.240054 -0.230971 0.393065 -0.346498 -0.390913 -0.220193 -0.199386 -0.262623 0.209208 0.224102 0.230652 0.189613 0.220363 0.199465 0.224867 0.202380 0.215854 0.219355 0.192769 0.221960 0.251974 0.257134 0.225584 0.230347 0.252746 0.254383 0.223878 0.226449 0.226931
chargesum: 0.00000
title: Mulliken charges with hydrogens summed into heavy atoms:
elementType: O O N C C C C C C C C C C C C C C C C C
charge: -0.261107 -0.305803 -0.083834 0.011794 0.089143 0.121189 0.017580 0.014676 0.275682 0.148993 -0.090463 -0.080595 -0.014470 -0.000624 0.393065 -0.093753 -0.136529 0.003685 0.027063 -0.035692
polarizability: 2.52245197e+02 -2.70148673e+01 1.81562497e+02 6.10520622e+00 -1.20302495e+01 1.49616332e+02
1716.lowfreq: -7.1712 -0.0004 0.0003 0.0009 7.4832 8.0815 23.2424 31.7004 32.7731
frequency: 22.8740 31.6598 32.7373 43.3754 47.8643 72.0707 95.6329 109.4478 141.1646 176.3223 195.8232 210.6065 237.5254 247.4189 257.3514 286.4270 298.7453 313.2489 356.2853 401.7198 408.1500 411.1902 439.7477 479.4480 489.1272 491.4609 536.9003 561.5041 593.8603 602.6236 616.9068 688.3288 713.6898 734.5658 750.4463 753.7020 767.0925 797.4936 820.4273 830.4202 843.0531 852.2875 897.2037 908.2839 923.4545 927.9383 962.8130 967.4873 981.2264 985.3186 1018.5023 1030.5768 1033.9924 1036.7910 1037.4472 1076.2399 1080.1480 1092.9860 1096.3263 1105.6092 1142.8534 1157.6945 1165.7430 1167.3068 1167.7978 1176.3019 1198.1796 1228.3753 1238.6413 1248.8440 1259.7759 1268.0314 1305.0183 1307.7974 1330.4246 1365.0178 1382.6214 1383.7579 1387.8906 1419.0743 1434.7551 1442.7172 1442.7823 1450.1854 1461.6873 1468.8056 1470.9536 1472.3835 1478.9548 1483.3951 1488.1545 1489.9704 1583.9375 1595.8484 1600.1247 1614.1345 2848.8542 2864.4035 2894.2950 2950.8380 2999.2281 3000.1292 3016.1690 3017.8504 3030.0549 3067.2979 3074.5150 3086.0744 3125.8774 3134.9724 3135.6872 3151.3910 3151.5960 3161.4436 3163.5336 3171.9902 3175.2351
redmass: 3.4998 4.3734 3.0304 4.3002 4.0249 4.4635 3.2373 3.1546 3.2004 5.0702 3.3551 2.9347 1.8082 1.3226 1.1737 4.8581 5.0999 4.5136 2.4250 2.6619 2.9472 2.5178 3.7370 3.3349 3.0859 4.2054 4.3690 5.9051 5.3304 5.3838 6.0906 2.3189 4.1201 2.7913 1.7577 1.4155 2.1291 2.7978 2.3493 1.2506 1.5081 5.1033 1.4345 2.3431 1.8451 1.7330 1.3586 1.3014 1.2895 6.1648 2.1016 1.7101 2.3787 2.0581 2.0104 1.5037 1.7345 1.4312 2.3601 1.9804 1.5364 1.6532 1.1866 1.2572 1.2478 1.4437 2.6316 1.3134 1.8908 2.9990 2.4268 1.5156 1.1834 1.3275 1.3426 1.6535 1.4724 3.7790 7.7581 1.1457 2.3634 1.1942 2.2362 1.0829 1.0515 1.0607 2.0363 1.5337 1.0486 1.0808 1.7412 1.0704 6.7731 6.6362 6.7119 6.7320 1.0566 1.0568 1.0665 1.0558 1.0736 1.0873 1.0726 1.0968 1.0736 1.1021 1.1008 1.0997 1.0846 1.0890 1.0854 1.0921 1.0908 1.0967 1.0940 1.0996 1.1002
irintensity: 0.0382 0.2436 0.4649 1.1659 0.3104 1.5584 2.1040 0.1434 0.2999 1.4976 0.6314 1.1343 1.1663 0.5476 1.2117 0.5775 1.3104 5.5056 7.7576 3.0015 0.2428 0.5717 4.7152 4.4552 13.0020 0.2976 1.8367 2.2142 2.1636 1.2430 0.9957 25.5437 0.4611 20.8252 19.7125 134.4855 42.2760 13.7924 20.8492 0.6798 0.0154 21.4311 5.4428 13.8261 20.3895 17.4910 0.1171 0.0527 0.5873 0.4425 9.6049 19.9487 33.2012 33.2066 19.2175 10.2329 0.8085 9.6672 67.9464 10.7288 3.5952 19.2004 20.5154 3.8395 8.0186 16.5409 132.6681 8.4310 71.2673 291.9849 0.9498 12.2740 3.4935 0.4087 2.0905 15.3557 8.2187 12.7242 3.7295 2.9251 19.8014 3.2158 3.8084 9.0045 16.8699 7.4896 59.4198 197.3178 11.8072 18.4541 56.8983 19.7661 16.2806 18.8681 32.3186 54.3985 66.2684 108.7469 86.5113 40.5388 7.2436 23.1523 56.8746 51.4319 61.1625 27.6807 42.4982 42.7968 1.9275 11.5667 1.8692 38.6970 2.6403 17.8767 18.4320 8.5579 12.5792
temp: 298.150 k
press: 1.00000 atm
elementType: 8 8 7 6 6 6 6 6 6 6 6 6 6 6 6 6 6 6 6 6 1 1 1 1 1 1 1 1 1 1 1 1 1 1 1 1 1 1 1 1 1
symmnumber: 1
zpe: 893756.6 jmol-1
zpe.correction: 0.340414 hartree
zpe.thermalcorrener: 0.359984 hartree
zpe.thermalcorrenthalpy: 0.360928 hartree
zpe.thermalcorrgfe: 0.290292 hartree
zpe.sumelectzpe: -864.074006 hartree
zpe.sumelectthermal: -864.054436 hartree
zpe.sumelectthermalent: -864.053492 hartree
zpe.sumelectthermalfe: -864.124129 hartree
dipole: -0.1275 -1.3960 1.5080
dipole: 2.0589
quadrupole: -111.8284 -115.7765 -117.2743
quadrupole: -9.0008 3.1919 -2.2514
quadrupole: 3.1313 -0.8168 -2.3146 -9.0008 3.1919 -2.2514
hfenergy: -864.4144202 hartree
pointgroup: C01 [X(C17H21N1O2)]
dipole: -0.1745818 -0.6430917 0.4605601 debye
polarizability: 239.9439784|-37.9382961|197.4383874|0.00162|-4.4389622|146.0416602 unknown
InChI: InChI=1S/C17H21NO2/c1-18(2)13-8-14-19-16-11-6-7-12-17(16)20-15-9-4-3-5-10-15/h3-7,9-12H,8,13-14H2,1-2H3
charge 0 multiplicity 1
41 atoms
O  0.190207 -1.235025 -0.533495
O  1.631866 1.123945 -0.577653
N  -4.130066 -0.919393 -0.195619
C  -2.030056 -2.088908 -0.95499
C  -2.727241 -1.26893 0.149774
C  -0.601104 -2.484373 -0.579632
C  -4.216836 0.088809 -1.275654
C  -4.883915 -0.480954 0.999205
C  1.538372 -1.317238 -0.185201
C  2.251551 -0.08105 -0.16308
C  2.228687 -2.513348 0.128719
C  3.623094 -0.052633 0.142836
C  3.607626 -2.475963 0.442836
C  4.310037 -1.251882 0.447411
C  0.558481 1.668047 0.170669
C  0.275984 1.301733 1.506128
C  -0.193524 2.667367 -0.486227
C  -0.783244 1.947462 2.183451
C  -1.247385 3.30296 0.203784
C  -1.550498 2.946204 1.540427
H  -2.618398 -3.00747 -1.14468
H  -1.990653 -1.520796 -1.902185
H  -2.118299 -0.360176 0.378032
H  -2.757538 -1.881828 1.07307
H  -0.16084 -3.16524 -1.336441
H  -0.565449 -2.979088 0.414007
H  -3.755045 -0.294175 -2.201296
H  -3.713103 1.053238 -1.010104
H  -5.279021 0.299823 -1.494458
H  -5.936915 -0.289832 0.72392
H  -4.473394 0.451821 1.464797
H  -4.869951 -1.279664 1.762574
H  1.703415 -3.4728 0.116203
H  4.135417 0.91439 0.131242
H  4.128949 -3.410257 0.677864
H  5.378263 -1.224857 0.684287
H  0.873426 0.53328 2.007191
H  0.056537 2.924983 -1.519719
H  -1.004583 1.66807 3.219878
H  -1.83234 4.078458 -0.30353
H  -2.367916 3.443485 2.073359
