program: Gaussian 09
title: 000212594
version: EM64L-G09RevD.01
frameworkgroup: C1[X(C14H27NO2)]
method: RPBEPBE
basis: SDD
operation: Freq
keyword: #p
keyword: freq=noraman
keyword: PBEPBE/SDD
title: #p freq=noraman PBEPBE/SDD
converged: YES YES NO NO
title: Mulliken charges:
elementType: O O N C C C C C C C C C C C C C C H H H H H H H H H H H H H H H H H H H H H H H H H H H
charge: -0.274037 -0.233803 -0.084391 -0.366679 -0.371257 -0.390513 -0.385307 -0.399415 -0.342018 0.196496 -0.369488 -0.315771 0.197566 -0.723501 -0.731344 -0.381739 -0.694998 0.177380 0.219546 0.210900 0.169302 0.193456 0.204182 0.203056 0.191857 0.214121 0.189343 0.222283 0.213223 0.191278 0.213338 0.235164 0.232015 0.212540 0.215907 0.238364 0.204335 0.221894 0.236631 0.209901 0.213401 0.207947 0.211208 0.217626
chargesum: 0.00000
title: Mulliken charges with hydrogens summed into heavy atoms:
elementType: O O N C C C C C C C C C C C C C C
charge: -0.274037 -0.233803 -0.084391 0.030247 0.008945 0.007125 0.009606 0.004049 0.093489 0.196496 0.035128 0.151408 0.197566 -0.056690 -0.068484 0.041562 -0.058216
polarizability: 1.98006168e+02 2.15354437e+00 1.46451135e+02 -1.22274878e+00 1.45295524e+00 1.47962980e+02
1716.lowfreq: -15.3263 -0.0010 -0.0009 -0.0007 1.4948 6.3749 16.0744 25.6280 30.1928
frequency: 8.3695 25.1643 30.0053 45.6707 66.6330 74.9048 82.2679 100.9455 153.7154 176.3426 194.6843 203.0152 225.0501 228.8321 239.6554 243.5487 272.6082 305.1430 313.7518 327.8501 349.0658 360.2136 372.5145 394.5588 439.1759 449.6119 456.0195 503.0401 559.6519 588.8472 717.1375 737.2356 742.9889 758.1679 798.2615 808.2074 836.4347 851.1065 855.3899 866.4281 895.6675 906.0157 935.9906 937.6888 957.2203 961.0167 993.4579 1000.4659 1043.3425 1050.7925 1051.2224 1059.8999 1067.4103 1097.6768 1101.7917 1103.2787 1115.2480 1130.1381 1149.3143 1160.5724 1175.1332 1197.3223 1211.8217 1216.0452 1255.8450 1262.0424 1266.5254 1274.3603 1289.9492 1293.9764 1297.2496 1312.3795 1318.0652 1331.4704 1339.7592 1346.6143 1351.7777 1354.2532 1370.2838 1377.4315 1389.0619 1391.4842 1396.4007 1447.9890 1450.2097 1450.3760 1459.3973 1462.0310 1463.2582 1468.2947 1469.2434 1471.3404 1474.2801 1475.9731 1477.0113 1482.1207 1484.8764 1489.8688 1621.4106 2825.0769 2835.2792 2901.4889 2967.2630 2967.8468 2972.1522 2978.6836 2980.0107 2984.5548 2986.4645 2989.9531 3019.5007 3023.3009 3033.7363 3035.3071 3040.7092 3043.1544 3044.5709 3045.9892 3055.2229 3069.8823 3070.5104 3072.6074 3084.5692 3096.0229 3101.6480 3124.0756
redmass: 3.1886 4.0142 3.5431 4.3212 1.6093 4.7918 3.5515 3.1176 2.3608 2.7385 1.1616 1.7056 1.3305 1.5139 1.8459 1.5954 3.0854 2.5142 2.4777 2.6518 3.2496 3.0908 2.5768 2.1637 3.2877 2.8694 2.9471 2.9384 2.4383 2.7071 3.8308 1.4438 2.2302 3.7570 1.5220 1.4253 2.0557 1.8031 1.9009 1.5143 2.3359 2.2305 3.4535 1.5080 1.3109 1.7891 2.5017 1.2904 2.2022 2.5474 1.9321 1.7509 2.3304 3.2878 1.7934 2.2215 2.2416 1.7875 1.3514 2.3676 2.6696 1.3881 2.3863 2.0974 1.3882 1.3317 1.2199 1.4654 1.2264 1.4626 1.3075 1.2712 1.3446 1.3114 1.4174 1.4840 1.4742 1.3928 1.3829 1.2083 1.2103 1.3768 1.2242 1.0854 1.0755 1.0919 1.0880 1.0607 1.0855 1.0891 1.0541 1.0564 1.0530 1.0869 1.0427 1.0939 1.0742 1.0659 9.7430 1.0716 1.0704 1.0690 1.0596 1.0625 1.0372 1.0367 1.0593 1.0613 1.0612 1.0369 1.0973 1.0882 1.0948 1.0723 1.0845 1.0819 1.1015 1.1020 1.1035 1.1008 1.1001 1.0996 1.0995 1.0998 1.0987 1.1076
irintensity: 0.1808 0.4150 0.1126 0.7659 0.0344 0.4410 0.6120 0.4452 0.1162 1.0353 0.1353 0.9645 0.2725 0.6362 0.5061 0.8381 2.7949 5.7985 1.6519 8.2650 3.4364 2.8240 10.3394 6.6252 0.9816 0.5300 2.8818 2.3654 1.5162 0.6685 3.8297 12.8334 7.8510 3.6977 0.5063 0.2545 7.9073 2.3394 10.6549 3.9914 9.7913 2.0124 26.6056 6.2740 2.7645 14.7040 20.9041 16.4834 2.4358 5.2301 16.4070 67.6151 9.7873 272.7922 78.3763 12.9513 7.2288 0.0756 5.2256 26.7609 5.1279 3.3227 11.0172 2.6228 3.8015 3.5022 13.6506 5.6941 2.3574 8.3228 7.5471 1.8169 5.3537 1.1395 0.2452 4.8043 1.6468 2.9383 8.5055 14.0150 8.4299 3.0647 24.6704 8.1082 3.7427 6.9557 13.0195 5.8194 5.2445 9.8646 1.2686 4.0183 12.5415 2.6441 16.2595 12.8328 9.0727 25.7729 141.7740 52.7644 131.2419 76.0544 6.4325 38.6536 47.5387 18.3538 54.9540 34.7337 33.8260 28.4403 0.7631 46.2725 78.7261 20.3159 3.9346 56.2436 15.7487 8.0590 101.5093 61.9514 36.9716 54.6441 50.2223 24.9988 28.9056 14.4719
temp: 298.150 k
press: 1.00000 atm
elementType: 8 8 7 6 6 6 6 6 6 6 6 6 6 6 6 6 6 1 1 1 1 1 1 1 1 1 1 1 1 1 1 1 1 1 1 1 1 1 1 1 1 1 1 1
symmnumber: 1
zpe: 1025779.5 jmol-1
zpe.correction: 0.390699 hartree
zpe.thermalcorrener: 0.410766 hartree
zpe.thermalcorrenthalpy: 0.411710 hartree
zpe.thermalcorrgfe: 0.339296 hartree
zpe.sumelectzpe: -753.489013 hartree
zpe.sumelectthermal: -753.468946 hartree
zpe.sumelectthermalent: -753.468002 hartree
zpe.sumelectthermalfe: -753.540415 hartree
dipole: 0.4051 -0.6063 -1.3783
dipole: 1.5592
quadrupole: -96.2406 -104.7700 -110.6649
quadrupole: -0.0365 1.4070 1.4402
quadrupole: 7.6513 -0.8782 -6.7731 -0.0365 1.4070 1.4402
hfenergy: -753.8797114 hartree
pointgroup: C01 [X(C14H27N1O2)]
dipole: -0.1705718 -0.2837529 -0.5164448 debye
polarizability: 198.0754355|-1.5724794|145.9963451|0.0390214|1.198195|148.3485024 unknown
InChI: InChI=1S/C14H27NO2/c1-4-8-14(2,3)13(16)17-12-11-15-9-6-5-7-10-15/h4-12H2,1-3H3
charge 0 multiplicity 1
44 atoms
O  0.930664 -0.756679 -0.476063
O  1.200072 1.24886 0.674643
N  -2.814147 -0.207846 -0.324171
C  -3.09586 0.853773 0.678211
C  -3.872481 -0.270599 -1.363722
C  -4.445771 0.604873 1.380014
C  -5.248931 -0.554462 -0.727665
C  -5.588863 0.508222 0.343114
C  -1.443169 -0.126226 -0.875608
C  3.069102 0.363837 -0.726188
C  3.829873 -0.926659 -0.268311
C  -0.459595 -0.861042 0.055145
C  1.665344 0.374305 -0.093647
C  2.91867 0.330228 -2.275859
C  3.820227 1.647673 -0.299964
C  4.012077 -1.095355 1.256897
C  4.752655 -2.404901 1.606355
H  -3.116783 1.863292 0.187934
H  -2.276619 0.874015 1.419282
H  -3.612706 -1.074559 -2.0775
H  -3.93071 0.688044 -1.945404
H  -4.640892 1.421988 2.101059
H  -4.381762 -0.340695 1.952468
H  -5.220558 -1.556574 -0.257512
H  -6.022981 -0.57471 -1.519051
H  -6.54637 0.264637 0.841186
H  -5.721072 1.494729 -0.148346
H  -1.100001 0.926387 -1.014889
H  -1.422627 -0.614281 -1.86728
H  4.827011 -0.910901 -0.75556
H  3.289156 -1.807557 -0.664881
H  -0.671876 -1.940278 0.078178
H  -0.486042 -0.440862 1.07527
H  3.920599 0.34191 -2.743651
H  2.361856 1.212177 -2.642845
H  2.387299 -0.579317 -2.602849
H  4.853494 1.621293 -0.692764
H  3.317551 2.547065 -0.696744
H  3.859715 1.754342 0.79639
H  4.57354 -0.2358 1.670807
H  3.020832 -1.091671 1.753047
H  5.759217 -2.426459 1.147074
H  4.196073 -3.286259 1.235544
H  4.877387 -2.51836 2.698856
